{"text_format":"1","workbook":"xlsx","n_sheets":4,"sheets":["Front","Rep_Data","Calculate","Summary"],"not_rendered":{"charts":4,"images":19,"macros":1,"external_links":0,"defined_names":0,"comments":0,"pivot_tables":0},"unopened":[],"bounds":{"document_bytes":16777216,"sheet_cells":100000,"rows_first":2000,"rows_last":500,"rows_between":2000,"halvings":0,"cell_chars":16384,"cell_head_chars":4096},"cells_cut":0,"cells_raw":0,"read":"whole","date_system":"1900"}

{"sheet":"Front","index":0,"n_rows":12,"n_cols":26,"rows_kept":12,"cut":false,"hidden":false,"merged":[]}
[]
[]
[]
[]
[null,null,null,null,null,null,null,null,null,null,null,null,null,null,null,null,null,null,null,null,null,null,null,null,"Name",{"$f":"Calculate!D3&\"  \" &Calculate!E3","v":"DOMITILA  AARON"}]
[null,null,null,null,null,null,null,null,null,null,null,null,null,null,null,null,null,null,null,null,null,null,null,null,"Address",{"$f":"Calculate!F3","v":"4605 Patti St"}]
[null,null,null,null,null,null,null,null,null,null,null,null,null,null,null,null,null,null,null,null,null,null,null,null,"City",{"$f":"Calculate!G3&\",  \"&Calculate!H3","v":"Hampton,  VA"}]
[null,null,null,null,null,null,null,null,null,null,null,null,null,null,null,null,null,null,null,null,null,null,null,null,"Pincode",{"$f":"Calculate!I3","v":"23681"}]
[]
[null,null,null,null,null,null,null,null,null,null,null,null,null,null,null,null,null,null,null,null,null,null,null,null,null,{"$f":"\" Questionnaire for Physician  -  \"&Z5","v":" Questionnaire for Physician  -  DOMITILA  AARON"}]
[]
[null,null,null,null,null,null,null,null,null,null,null,null,null,null,null,null,null,null,null,null,null,null,null,null,null,"& \"  (\"&Calculate!J3&\")\""]

{"sheet":"Rep_Data","index":1,"n_rows":252,"n_cols":18,"rows_kept":252,"cut":false,"hidden":true,"merged":[]}
[]
["Physician Name","Name of the Rep","Physician ID","First Name","Last Name","Street Address 1"," City"," State"," Zip","Speciality","Physician Name",null,null,"Q1","Q2","Q3","Q4","Q5"]
["AARON,  DOMITILA","Barbara Green","O65016","DOMITILA","AARON","4605 Patti St","Hampton","VA","23681","GP","AARON,  DOMITILA",null,null,"NO","NONE","NONE","1","2 or Less"]
["ABIGAIL,  JAMISON","Barbara Green","O76771","JAMISON","ABIGAIL","1397 Stepanie Wy","Ferndale","FL","34729","GP","ABIGAIL,  JAMISON",null,null,"","","","",""]
["AI,  LAKEESHA","Barbara Green","O68016","LAKEESHA","AI","2851 Twyla Ave","Boca Raton","FL","33428","Ortho","AI,  LAKEESHA",null,null,"","","","",""]
["ALBERT,  ALI","Barbara Green","O65520","ALI","ALBERT","3708 Tifany Ave","Stockbridge","GA","30281","GP","ALBERT,  ALI",null,null,"YES","3 - 4","3 - 5","2 - 3","2 or Less"]
["ALBERTHA,  BRIGETTE","Barbara Green","O58834","BRIGETTE","ALBERTHA","601 Ivy St","Bridgeton","IN","47836","Surgery","ALBERTHA,  BRIGETTE",null,null,"YES","3 - 4","1 - 3","More than 3","More than 2"]
["ALISA,  KRYSTYNA","Barbara Green","O59647","KRYSTYNA","ALISA","1749 169th St","Greenwood Springs","MS","38848","GP","ALISA,  KRYSTYNA"]
["ALTON,  THANH","Barbara Green","O61755","THANH","ALTON","930 193rd St","Summitville","NY","12781","Ortho","ALTON,  THANH",null,null,"YES","3 - 4","3 - 5","2 - 3","More than 2"]
["ALVINA,  ERNIE","Barbara Green","O71265","ERNIE","ALVINA","845 268th St","Wilton","CT","06897","GP","ALVINA,  ERNIE"]
["ALYSIA,  SHERILYN","Barbara Green","O63685","SHERILYN","ALYSIA","3402 Alanna Ave","Earth","TX","79031","GP","ALYSIA,  SHERILYN"]
["ANDRE,  YVONNE","Barbara Green","O63747","YVONNE","ANDRE","2640 229th Ave","Independence","MO","64056","Surgery","ANDRE,  YVONNE",null,null,"NO","3 - 4","1 - 3","2 - 3","2 or Less"]
["ANDREA,  NICKIE","Barbara Green","O79689","NICKIE","ANDREA","Offc 11I, 3205 272nd Ave","Bathgate","ND","58216","Surgery","ANDREA,  NICKIE",null,null,"NO","1 - 2","NONE","2 - 3","More than 2"]
["ANGELO,  SHONDRA","Barbara Green","O75260","SHONDRA","ANGELO","3590 Adam Ave","Kansas City","MO","64110","Ortho","ANGELO,  SHONDRA",null,null,"YES","1 - 2","NONE","1","2 or Less"]
["ANITRA,  STEPANIE","Barbara Green","O61474","STEPANIE","ANITRA","2110 281st St","Pacific Grove","CA","93950","GP","ANITRA,  STEPANIE"]
["ANTIONE,  MARC","Barbara Green","O79277","MARC","ANTIONE","354 209th Ave","Sugar Valley","GA","30746","Surgery","ANTIONE,  MARC",null,null,"YES","1 - 2","NONE","2 - 3","More than 2"]
["ANTONIO,  ROSALYN","Barbara Green","O53142","ROSALYN","ANTONIO","3528 Sharon Ave","Aurora","CO","80014","GP","ANTONIO,  ROSALYN"]
["ASHA,  KUM","Barbara Green","O79730","KUM","ASHA","4141 Dung St","Norwood","MN","55383","Ortho","ASHA,  KUM"]
["AUDIE,  AUGUST","Barbara Green","O57841","AUGUST","AUDIE","1952 Doug Trnpk","Ocate","NM","87734","GP","AUDIE,  AUGUST",null,null,"YES","3 - 4","1 - 3","More than 3","More than 2"]
["AUGUSTA,  KIMBERLEE","Barbara Green","O60307","KIMBERLEE","AUGUSTA","955 Faith Ave","Canada","KY","41519","GP","AUGUSTA,  KIMBERLEE",null,null,"YES","1 - 2","NONE","1","2 or Less"]
["AURELIO,  ETHAN","Barbara Green","O69052","ETHAN","AURELIO","1766 Shaun St","Chambersville","PA","15723","GP","AURELIO,  ETHAN"]
["AWILDA,  LAWRENCE","Barbara Green","O74602","LAWRENCE","AWILDA","3859 Kurtis St","Chattanooga","TN","37450","Ortho","AWILDA,  LAWRENCE"]
["AZALEE,  HUONG","Barbara Green","O72714","HUONG","AZALEE","Apt 17, 4821 Annabell St","Fresno","CA","93773","Ortho","AZALEE,  HUONG"]
["BAMBI,  LEEANN","Barbara Green","O68850","LEEANN","BAMBI","585 Zane Blvd","Fort Harrison","MT","59636","GP","BAMBI,  LEEANN"]
["BARBAR,  EVETTE","Barbara Green","O50681","EVETTE","BARBAR","2872 Janiece St","Roselawn","IN","46372","GP","BARBAR,  EVETTE",null,null,"NO","1 - 2","NONE","2 - 3","2 or Less"]
["BECKIE,  MARLINE","Barbara Green","O63823","MARLINE","BECKIE","2494 207th St","Providence","RI","02906","GP","BECKIE,  MARLINE"]
["BELIA,  JAMI","Barbara Green","O62845","JAMI","BELIA","Offc 20, 4789 62nd St","Bruno","MN","55712","GP","BELIA,  JAMI",null,null,"YES","3 - 4","1 - 3","More than 3","More than 2"]
["BENITA,  JACKELYN","Barbara Green","O57426","JACKELYN","BENITA","Apt 10, 1729 38th St","Charlottesville","IN","46117","GP","BENITA,  JACKELYN",null,null,"YES","1 - 2","NONE","1","2 or Less"]
["BENTON,  DORA","Barbara Green","O69673","DORA","BENTON","982 219th Ave","Lamona","WA","99144","GP","BENTON,  DORA"]
["BILLIE,  BURL","Barbara Green","O51409","BURL","BILLIE","4623 Letha Ave","Saint Augustine","FL","32092","GP","BILLIE,  BURL"]
["BLANCA,  WILDA","Barbara Green","O72299","WILDA","BLANCA","4738 Dexter Ave","Washougal","WA","98671","GP","BLANCA,  WILDA",null,null,"YES","3 - 4","1 - 3","1","More than 2"]
["BRADY,  DORRIS","Barbara Green","O56575","DORRIS","BRADY","3082 Marilu St","Simi Valley","CA","93065","GP","BRADY,  DORRIS",null,null,"YES","3 - 4","1 - 3","1","More than 2"]
["BRANDON,  LOUISE","Barbara Green","O59760","LOUISE","BRANDON","3711 39th Ave","Baldwinsville","NY","13027","Surgery","BRANDON,  LOUISE"]
["BREANA,  KYLEE","Barbara Green","O51694","KYLEE","BREANA","740 Vashti St","Plush","OR","97637","Ortho","BREANA,  KYLEE"]
["BRIANNA,  SHELLEY","Barbara Green","O65594","SHELLEY","BRIANNA","4081 Leslie Trnpk","Centerfield","UT","84622","GP","BRIANNA,  SHELLEY"]
["BROOKS,  ALISA","Barbara Green","O74690","ALISA","BROOKS","Unit 11O, 4763 Myesha Ave","Sacramento","CA","94235","GP","BROOKS,  ALISA"]
["BURMA,  BRYANNA","Barbara Green","O73883","BRYANNA","BURMA","1459 Georgine St","Broughton","IL","62817","Surgery","BURMA,  BRYANNA"]
["BURTON,  LINDY","Barbara Green","O55797","LINDY","BURTON","Unit 15, 3636 Donna Ave","Gypsum","CO","81637","Ortho","BURTON,  LINDY"]
["CARMELLA,  LYNN","Barbara Green","O51891","LYNN","CARMELLA","1590 Selena Ave","Bicknell","IN","47512","Ortho","CARMELLA,  LYNN",null,null,"YES","3 - 4","1 - 3","1","More than 2"]
["CECIL,  MARLEN","Barbara Green","O54818","MARLEN","CECIL","1375 Elenor St","Torrance","CA","90509","GP","CECIL,  MARLEN"]
["CECIL,  TAMEIKA","Barbara Green","O62473","TAMEIKA","CECIL","1807 Lizabeth Ave","Basom","NY","14013","Ortho","CECIL,  TAMEIKA"]
["CELESTA,  HYON","Barbara Green","O67977","HYON","CELESTA","3643 Lizabeth Ave","Condon","MT","59826","GP","CELESTA,  HYON"]
["CELIA,  SHERRIL","Barbara Green","O65880","SHERRIL","CELIA","3643 Devora Conc","Fullerton","CA","92831","Ortho","CELIA,  SHERRIL"]
["CHANTELLE,  AGUSTINA","Barbara Green","O58712","AGUSTINA","CHANTELLE","1722 Enda St","Rowesville","SC","29133","GP","CHANTELLE,  AGUSTINA"]
["CHARLINE,  LUANA","Barbara Green","O69207","LUANA","CHARLINE","Apt 17G, 1431 Frederica Ave","Miami","FL","33199","Ortho","CHARLINE,  LUANA",null,null,"YES","1 - 2","NONE","1","2 or Less"]
["CHARLOTTE,  RANDA","Barbara Green","O60783","RANDA","CHARLOTTE","3203 Anne Pl","Davin","WV","25617","Surgery","CHARLOTTE,  RANDA"]
["CHERYLL,  CARLENE","Barbara Green","O54845","CARLENE","CHERYLL","165 Loreta St","Williamstown","NJ","08094","GP","CHERYLL,  CARLENE"]
["CHRISTINE,  DORTHEY","Barbara Green","O56142","DORTHEY","CHRISTINE","1893 Trudy Wy","Sacramento","CA","95857","GP","CHRISTINE,  DORTHEY"]
["CLARIBEL,  SPENCER","Barbara Green","O58483","SPENCER","CLARIBEL","1260 292nd St","Murdock","KS","67111","Surgery","CLARIBEL,  SPENCER"]
["CLAUDE,  ROSIE","Barbara Green","O66597","ROSIE","CLAUDE","390 272nd Ave","Flossmoor","IL","60422","Surgery","CLAUDE,  ROSIE"]
["CLAY,  TRUMAN","Barbara Green","O54279","TRUMAN","CLAY","3254 Emory St","King Ferry","NY","13081","GP","CLAY,  TRUMAN"]
["CLINTON,  SHAN","Barbara Green","O77045","SHAN","CLINTON","963 Darcy St","Columbia Station","OH","44028","Surgery","CLINTON,  SHAN"]
["CONCEPCION,  MARICA","Barbara Green","O79960","MARICA","CONCEPCION","Apt 9A, 1207 Idell St","Pittsfield","MA","01202","GP","CONCEPCION,  MARICA"]
["CONSUELO,  NOMA","Barbara Green","O66819","NOMA","CONSUELO","3253 25th Ave","Arabi","GA","31712","GP","CONSUELO,  NOMA"]
["CORETTA,  JOEY","Barbara Green","O64707","JOEY","CORETTA","4021 Iliana St","Campbell","MN","56522","GP","CORETTA,  JOEY"]
["CORRINE,  CASSIE","Barbara Green","O63095","CASSIE","CORRINE","Apt 11X, 4215 45th Ave","Rayne","LA","70578","GP","CORRINE,  CASSIE",null,null,"","","","",""]
["CRISTOBAL,  SAMELLA","Barbara Green","O79444","SAMELLA","CRISTOBAL","83 Velvet Wy","Ocean View","NJ","08230","GP","CRISTOBAL,  SAMELLA",null,null,"YES","1 - 2","NONE","1","2 or Less"]
["CURTIS,  MYESHA","Barbara Green","O59162","MYESHA","CURTIS","3576 Jamey Ave","Egg Harbor City","NJ","08215","GP","CURTIS,  MYESHA"]
["DANIEL,  MARIELA","Barbara Green","O74331","MARIELA","DANIEL","3813 Luetta Ave","Wasilla","AK","99654","GP","DANIEL,  MARIELA"]
["DANNIE,  ALIX","Barbara Green","O59472","ALIX","DANNIE","2832 93rd Ave","Hamilton Dome","WY","82427","GP","DANNIE,  ALIX",null,null,"YES","3 - 4","1 - 3","2 - 3","More than 2"]
["DANUTA,  ENRIQUETA","Barbara Green","O50024","ENRIQUETA","DANUTA","4338 Alisia Ct","Empire","CA","95319","Ortho","DANUTA,  ENRIQUETA"]
["DELORIS,  SANJUANA","Barbara Green","O63478","SANJUANA","DELORIS","Apt 11, 941 106th St","Thornwood","NY","10594","GP","DELORIS,  SANJUANA"]
["DERRICK,  DELL","Barbara Green","O79076","DELL","DERRICK","2608 39th Ave","Callahan","FL","32011","GP","DERRICK,  DELL"]
["DEWITT,  BETHANY","Barbara Green","O66747","BETHANY","DEWITT","4863 Arthur Blvd","Tustin","MI","49688","GP","DEWITT,  BETHANY",null,null,"YES","1 - 2","NONE","1","2 or Less"]
["DEXTER,  RENALDO","Barbara Green","O51555","RENALDO","DEXTER","305 Eura Jctn","Brandon","SD","57005","GP","DEXTER,  RENALDO",null,null,"YES","3 - 4","1 - 3","2 - 3","More than 2"]
["DIANNE,  LYNDSAY","Barbara Green","O50217","LYNDSAY","DIANNE","4673 Harland Crsg","Belford","NJ","07718","Ortho","DIANNE,  LYNDSAY"]
["DICK,  FLAVIA","Barbara Green","O68382","FLAVIA","DICK","Offc 12, 4803 133rd Ave","Chatawa","MS","39632","Ortho","DICK,  FLAVIA"]
["DORIAN,  ELIZBETH","Barbara Green","O55017","ELIZBETH","DORIAN","1019 297th Ave","Pavo","GA","31778","Surgery","DORIAN,  ELIZBETH"]
["DORINDA,  FREDIA","Barbara Green","O53143","FREDIA","DORINDA","3010 Un Ct","Elliott","SC","29046","GP","DORINDA,  FREDIA"]
["DORTHEY,  THELMA","Barbara Green","O60917","THELMA","DORTHEY","2403 Tabatha Trnpk","Columbia","IL","62236","GP","DORTHEY,  THELMA",null,null,"YES","3 - 4","1 - 3","2 - 3","More than 2"]
["DOUG,  LEO","Barbara Green","O58292","LEO","DOUG","Unit 11, 2868 Fredericka Ave","Tiverton","RI","02878","GP","DOUG,  LEO"]
["EASTER,  YUK","Barbara Green","O55115","YUK","EASTER","1239 42nd St","Princeton","CA","95970","GP","EASTER,  YUK"]
["ELINOR,  JEANMARIE","Barbara Green","O52424","JEANMARIE","ELINOR","2783 163rd Ave","Mc Donald","OH","44437","Ortho","ELINOR,  JEANMARIE",null,null,"","","","",""]
["ELISHA,  ROSEANNA","Barbara Green","O67245","ROSEANNA","ELISHA","4842 Leota St","Crawfordville","FL","32327","GP","ELISHA,  ROSEANNA",null,null,"YES","NONE","NONE","2 - 3","More than 2"]
["ELKE,  KASIE","Barbara Green","O68966","KASIE","ELKE","2319 Mikaela Ave","Gifford","SC","29923","GP","ELKE,  KASIE"]
["ELLAN,  MILES","Barbara Green","O68500","MILES","ELLAN","2696 Annabel St","Jacob","IL","62950","GP","ELLAN,  MILES"]
["ELODIA,  DEREK","Barbara Green","O58818","DEREK","ELODIA","2072 Liana St","Florence","KY","41022","Surgery","ELODIA,  DEREK",null,null,"YES","1 - 2","NONE","1","2 or Less"]
["ELOUISE,  THRESA","Barbara Green","O66803","THRESA","ELOUISE","530 Jame Ave","Westwego","LA","70094","Ortho","ELOUISE,  THRESA"]
["ELSY,  JILL","Barbara Green","O50249","JILL","ELSY","1389 231st Ave","Dothan","AL","36305","GP","ELSY,  JILL"]
["EMA,  TATUM","Barbara Green","O65812","TATUM","EMA","3701 Rona Blvd","Bluff","UT","84512","GP","EMA,  TATUM"]
["EMERALD,  VERONICA","Barbara Green","O51734","VERONICA","EMERALD","1831 287th Ave","North Adams","MI","49262","GP","EMERALD,  VERONICA"]
["EMERITA,  DELINDA","Barbara Green","O70232","DELINDA","EMERITA","4809 Leigh St","Anderson","IN","46013","Ortho","EMERITA,  DELINDA"]
["EMIL,  SOLEDAD","Barbara Green","O79708","SOLEDAD","EMIL","2161 277th Ave","Cochiti Pueblo","NM","87072","GP","EMIL,  SOLEDAD",null,null,"YES","3 - 4","1 - 3","2 - 3","More than 2"]
["ENOLA,  ALYSHA","Barbara Green","O67414","ALYSHA","ENOLA","4845 Kandra St","Hogansburg","NY","13655","GP","ENOLA,  ALYSHA",null,null,"YES","3 - 4","1 - 3","2 - 3","More than 2"]
["ERLINE,  PATRICK","Barbara Green","O55710","PATRICK","ERLINE","4977 Dinah Ave","Cambria","CA","93428","Surgery","ERLINE,  PATRICK",null,null,"YES","3 - 4","1 - 3","2 - 3","More than 2"]
["ESTELA,  THUY","Barbara Green","O71638","THUY","ESTELA","2317 Kaitlyn St","Phoenix","AZ","85025","GP","ESTELA,  THUY"]
["ETHA,  KAZUKO","Barbara Green","O61792","KAZUKO","ETHA","1908 43rd St","Linden","NC","28356","Surgery","ETHA,  KAZUKO"]
["FANNIE,  ADELL","Barbara Green","O57731","ADELL","FANNIE","1667 85th St","Bristol","VA","24201","GP","FANNIE,  ADELL"]
["FELICIA,  CARLY","Barbara Green","O55326","CARLY","FELICIA","2709 Maye Ave","Thibodaux","LA","70301","GP","FELICIA,  CARLY",null,null,"YES","1 - 2","NONE","1","2 or Less"]
["FELICITA,  EVELIA","Barbara Green","O66703","EVELIA","FELICITA","4469 Richie St","Salem","VA","24155","GP","FELICITA,  EVELIA"]
["FILIBERTO,  SPARKLE","Barbara Green","O66037","SPARKLE","FILIBERTO","1210 Aaron Ave","El Toro","CA","92609","Ortho","FILIBERTO,  SPARKLE"]
["FLETA,  LASHELL","Barbara Green","O66816","LASHELL","FLETA","4129 Sarah Ave","Brookfield","CT","06804","GP","FLETA,  LASHELL"]
["FLORENTINO,  SHELTON","Barbara Green","O61123","SHELTON","FLORENTINO","Offc 20, 2339 Wynona Jctn","Fresno","CA","93844","GP","FLORENTINO,  SHELTON"]
["FRANCINA,  VIVIAN","Barbara Green","O65644","VIVIAN","FRANCINA","3976 Neville Ave","Henry","TN","38231","Ortho","FRANCINA,  VIVIAN"]
["FRANCISCA,  AUREA","Barbara Green","O77161","AUREA","FRANCISCA","2112 Sandra Ave","Bon Aqua","TN","37025","GP","FRANCISCA,  AUREA",null,null,"YES","1 - 2","NONE","1","2 or Less"]
["GEOFFREY,  CLARENCE","Barbara Green","O63883","CLARENCE","GEOFFREY","2859 Gene Ave","Barwick","GA","31720","Surgery","GEOFFREY,  CLARENCE"]
["GEORGE,  THANH","Barbara Green","O65853","THANH","GEORGE","2495 270th St","Seville","OH","44273","GP","GEORGE,  THANH"]
["GRISELDA,  PEDRO","Barbara Green","O53759","PEDRO","GRISELDA","Apt 4, 4456 Gidget Wy","Dousman","WI","53118","GP","GRISELDA,  PEDRO"]
["HANNA,  KARL","Barbara Green","O76044","KARL","HANNA","4178 Jesse Cswy","Pueblo","CO","81002","Ortho","HANNA,  KARL"]
["HANS,  ANNETT","Barbara Green","O63503","ANNETT","HANS","4978 Chantel Ave","Newport","VT","05855","Surgery","HANS,  ANNETT"]
["HELEN,  BLYTHE","Barbara Green","O59649","BLYTHE","HELEN","4863 210th St","Latah","WA","99018","Ortho","HELEN,  BLYTHE"]
["HOLLIS,  CARMELO","Barbara Green","O76740","CARMELO","HOLLIS","Offc 2, 3541 Margarito Ct","Kennard","IN","47351","GP","HOLLIS,  CARMELO",null,null,"YES","3 - 4","1 - 3","2 - 3","More than 2"]
["HOSEA,  DACIA","Barbara Green","O50471","DACIA","HOSEA","1815 Jean Ave","Inverness","FL","34451","Surgery","HOSEA,  DACIA",null,null,"YES","1 - 2","NONE","1","2 or Less"]
["IDALIA,  DORATHY","Barbara Green","O65264","DORATHY","IDALIA","2396 Marion Ave","Venetia","PA","15367","GP","IDALIA,  DORATHY"]
["INEZ,  SHAWNEE","Barbara Green","O78661","SHAWNEE","INEZ","1867 Candace St","Marthasville","MO","63357","Surgery","INEZ,  SHAWNEE"]
["IRAIDA,  HYUN","Barbara Green","O63145","HYUN","IRAIDA","2950 Sherron Ave","North Las Vegas","NV","89031","GP","IRAIDA,  HYUN"]
["ISAIAS,  LIANNE","Barbara Green","O63702","LIANNE","ISAIAS","3282 Kermit St","Shaktoolik","AK","99771","GP","ISAIAS,  LIANNE"]
["ISELA,  ERIN","Barbara Green","O78326","ERIN","ISELA","2nd Floor, 256 73rd Ave","Holtsville","NY","00501","GP","ISELA,  ERIN"]
["JANET,  EVETTE","Barbara Green","O72326","EVETTE","JANET","Apt 4, 959 Sharee Ave","Gladstone","ND","58630","GP","JANET,  EVETTE"]
["JANICE,  SOFIA","Barbara Green","O56588","SOFIA","JANICE","3212 49th St","Greensboro","NC","27407","GP","JANICE,  SOFIA",null,null,"YES","3 - 4","1 - 3","2 - 3","More than 2"]
["JANNETTE,  MARYBELLE","Barbara Green","O56098","MARYBELLE","JANNETTE","2701 Onita St","Lake Ann","MI","49650","GP","JANNETTE,  MARYBELLE"]
["JENICE,  NAKESHA","Barbara Green","O56948","NAKESHA","JENICE","1380 Valery St","Manomet","MA","02345","GP","JENICE,  NAKESHA",null,null,"YES","1 - 2","NONE","1","2 or Less"]
["JENNI,  ARNETTE","Barbara Green","O71795","ARNETTE","JENNI","Apt 14, 1303 130th Ave","Niagara Falls","NY","14303","GP","JENNI,  ARNETTE"]
["JERALDINE,  JEANNA","Barbara Green","O58134","JEANNA","JERALDINE","1365 133rd Ave","Pukwana","SD","57370","GP","JERALDINE,  JEANNA",null,null,"YES","1 - 2","NONE","1","More than 2"]
["JOANNA,  REVA","Barbara Green","O63775","REVA","JOANNA","Offc 2S, 4389 132nd Ave","Erath","LA","70533","Ortho","JOANNA,  REVA"]
["JOEL,  HOLLIS","Barbara Green","O63105","HOLLIS","JOEL","3787 Chrystal St","Maud","OK","74854","GP","JOEL,  HOLLIS"]
["JOHNNY,  LASHAWN","Barbara Green","O60773","LASHAWN","JOHNNY","Offc 19J, 2822 Casey St","Cusseta","AL","36852","GP","JOHNNY,  LASHAWN"]
["JOSIE,  LAMONT","Barbara Green","O59419","LAMONT","JOSIE","3rd Floor, 1263 Tamisha St","Hyde Park","PA","15641","Surgery","JOSIE,  LAMONT",null,null,"YES","1 - 2","NONE","1","2 or Less"]
["JOVITA,  ELISEO","Barbara Green","O55890","ELISEO","JOVITA","3758 230th Ave","Cross Plains","TN","37049","Surgery","JOVITA,  ELISEO"]
["JULIE,  FAYE","Barbara Green","O73801","FAYE","JULIE","2374 299th Ave","Omaha","NE","68134","Ortho","JULIE,  FAYE",null,null,"YES","1 - 2","NONE","1","2 or Less"]
["JUNG,  ADRIANA","Barbara Green","O62057","ADRIANA","JUNG","3674 50th St","Newark","TX","76071","GP","JUNG,  ADRIANA"]
["KASANDRA,  WESLEY","Barbara Green","O62917","WESLEY","KASANDRA","593 Usha St","Rockford","IL","61106","GP","KASANDRA,  WESLEY"]
["KATHLINE,  LAVERN","Barbara Green","O64183","LAVERN","KATHLINE","1571 Jc Blvd","Shrewsbury","NJ","07702","GP","KATHLINE,  LAVERN"]
["KATHRINE,  TAMELA","Barbara Green","O52456","TAMELA","KATHRINE","Unit 3, 3412 Edmundo St","Spencer","OH","44275","GP","KATHRINE,  TAMELA"]
["KATHRYN,  CRISTIE","Barbara Green","O69889","CRISTIE","KATHRYN","4402 153rd Ave","Canastota","NY","13032","GP","KATHRYN,  CRISTIE"]
["KENDRA,  GEORGETTE","Barbara Green","O57492","GEORGETTE","KENDRA","3318 Vito Ave","Jacksonville","MO","65260","GP","KENDRA,  GEORGETTE"]
["KENNETH,  DELL","Barbara Green","O55014","DELL","KENNETH","838 Roberto Ave","Seadrift","TX","77983","GP","KENNETH,  DELL"]
["KENT,  OLIVA","Barbara Green","O75648","OLIVA","KENT","Offc 9, 152 43rd St","South Bend","IN","46699","Ortho","KENT,  OLIVA",null,null,"YES","1 - 2","NONE","1","2 or Less"]
["KUM,  LASONYA","Barbara Green","O52495","LASONYA","KUM","67th Floor, 4959 Andree Ave","Spring Glen","PA","17978","Surgery","KUM,  LASONYA"]
["KYLEE,  LESA","Barbara Green","O76721","LESA","KYLEE","914 245th St","Mayer","AZ","86333","GP","KYLEE,  LESA",null,null,"YES","1 - 2","NONE","1","2 or Less"]
["LANNIE,  ELEANORA","Barbara Green","O72101","ELEANORA","LANNIE","1503 Suzan Ave","Hobson","TX","78117","GP","LANNIE,  ELEANORA"]
["LAREE,  CLAUDE","Barbara Green","O59900","CLAUDE","LAREE","Offc 10S, 552 Dorotha Crsg","Lansing","MI","48919","GP","LAREE,  CLAUDE"]
["LASHAWN,  CATHIE","Barbara Green","O78651","CATHIE","LASHAWN","3177 Kylee Jctn","Grand Coteau","LA","70541","GP","LASHAWN,  CATHIE"]
["LASHAWN,  MARK","Barbara Green","O58757","MARK","LASHAWN","Offc 17, 3482 Mikel Ave","Orlando","FL","32818","GP","LASHAWN,  MARK"]
["LAURENCE,  VERNITA","Barbara Green","O67015","VERNITA","LAURENCE","3081 Ashlyn Ave","Mammoth Lakes","CA","93546","Ortho","LAURENCE,  VERNITA"]
["LAURI,  JAMIE","Barbara Green","O63791","JAMIE","LAURI","1140 37th St","Steen","MN","56173","GP","LAURI,  JAMIE"]
["LAURINDA,  ZACHERY","Barbara Green","O68322","ZACHERY","LAURINDA","Offc 6, 4541 46th St","Goodrich","MI","48438","GP","LAURINDA,  ZACHERY",null,null,"YES","1 - 2","NONE","1","2 or Less"]
["LAWRENCE,  LEONTINE","Barbara Green","O70890","LEONTINE","LAWRENCE","1967 Jan St","Springfield","SC","29146","GP","LAWRENCE,  LEONTINE"]
["LAYLA,  RIVKA","Barbara Green","O55531","RIVKA","LAYLA","2862 Otha St","South Boardman","MI","49680","GP","LAYLA,  RIVKA"]
["LEAN,  ROBERTO","Barbara Green","O71798","ROBERTO","LEAN","Offc 4, 4446 Marni St","Riddlesburg","PA","16672","GP","LEAN,  ROBERTO"]
["LEKISHA,  ETHYL","Barbara Green","O56147","ETHYL","LEKISHA","Unit 1, 2604 Mina Ave","Jacksonville","FL","32225","Surgery","LEKISHA,  ETHYL"]
["LELAH,  KARLENE","Barbara Green","O71271","KARLENE","LELAH","2205 Sabrina Ct","Lincoln's New Salem","IL","62659","GP","LELAH,  KARLENE"]
["LENARD,  FATIMAH","Barbara Green","O74081","FATIMAH","LENARD","1234 60th St","Camden","NJ","08102","Surgery","LENARD,  FATIMAH"]
["LENNA,  EDITH","Barbara Green","O59422","EDITH","LENNA","229 Felisa Ave","San Bernardino","CA","92424","Ortho","LENNA,  EDITH"]
["LETA,  EVE","Barbara Green","O59652","EVE","LETA","730 Kimbra St","Milton Village","MA","02187","GP","LETA,  EVE"]
["LIBBIE,  CHRISTY","Barbara Green","O59535","CHRISTY","LIBBIE","3973 258th St","San Simeon","CA","93452","GP","LIBBIE,  CHRISTY"]
["LILY,  DEBBY","Barbara Green","O78728","DEBBY","LILY","134 Latia Blvd","Houston","TX","77216","GP","LILY,  DEBBY"]
["LIZA,  GLAYDS","Barbara Green","O57690","GLAYDS","LIZA","4095 185th St","Spartanburg","SC","29318","GP","LIZA,  GLAYDS"]
["LIZETH,  RODOLFO","Barbara Green","O74897","RODOLFO","LIZETH","582 Ione Jctn","New Smyrna Beach","FL","32169","GP","LIZETH,  RODOLFO"]
["LOREN,  DIEGO","Barbara Green","O52422","DIEGO","LOREN","2920 Latarsha Ave","South Bend","IN","46624","Ortho","LOREN,  DIEGO",null,null,"YES","1 - 2","NONE","1","2 or Less"]
["LORENA,  ALVERA","Barbara Green","O59243","ALVERA","LORENA","4729 Aubrey St","Boston","MA","02117","Ortho","LORENA,  ALVERA",null,null,"YES","1 - 2","NONE","1","2 or Less"]
["LUCILLA,  CHRISTENA","Barbara Green","O56014","CHRISTENA","LUCILLA","4963 Jules Conc","Chicago","IL","60660","Ortho","LUCILLA,  CHRISTENA",null,null,"YES","1 - 2","NONE","1","2 or Less"]
["LUCILLA,  STEVEN","Barbara Green","O67867","STEVEN","LUCILLA","3302 Fredia Ave","Temple","TX","76503","GP","LUCILLA,  STEVEN"]
["MADALYN,  ANISSA","Barbara Green","O76856","ANISSA","MADALYN","2069 Karren St","Kansas City","MO","64117","GP","MADALYN,  ANISSA"]
["MAISIE,  MEI","Barbara Green","O58603","MEI","MAISIE","1692 Amee Ave","Nashua","NH","03061","GP","MAISIE,  MEI"]
["MALIA,  ALLENA","Barbara Green","O74849","ALLENA","MALIA","3235 Arie Ave","Vernonia","OR","97064","Surgery","MALIA,  ALLENA"]
["MARCELINO,  KUM","Barbara Green","O70996","KUM","MARCELINO","4310 245th St","Star Lake","NY","13690","GP","MARCELINO,  KUM"]
["MARCIA,  NAN","Barbara Green","O75540","NAN","MARCIA","Unit 13, 4227 69th St","West Haven","CT","06516","GP","MARCIA,  NAN"]
["MARCIE,  IDELL","Barbara Green","O75491","IDELL","MARCIE","1981 34th St","Detroit","MI","48235","GP","MARCIE,  IDELL"]
["MARIA,  TIJUANA","Barbara Green","O68568","TIJUANA","MARIA","2548 39th Ave","Shreveport","LA","71101","Surgery","MARIA,  TIJUANA"]
["MARIO,  ROLANDO","Barbara Green","O77130","ROLANDO","MARIO","446 Charissa Ave","Wildorado","TX","79098","Ortho","MARIO,  ROLANDO"]
["MARISELA,  DALILA","Barbara Green","O63987","DALILA","MARISELA","1097 286th Ave","Mc Leod","MT","59052","Surgery","MARISELA,  DALILA"]
["MARISSA,  AMI","Barbara Green","O59951","AMI","MARISSA","1965 Latrina St","Springfield","MA","01115","GP","MARISSA,  AMI"]
["MARK,  MY","Barbara Green","O69651","MY","MARK","Offc 9Z, 3085 Yuonne Ave","Sugar Valley","GA","30746","Surgery","MARK,  MY"]
["MARLEN,  CASANDRA","Barbara Green","O74877","CASANDRA","MARLEN","450 Clarice Wy","Waltham","MA","02454","Surgery","MARLEN,  CASANDRA"]
["MARTHA,  DOVIE","Barbara Green","O76446","DOVIE","MARTHA","4159 125th Ave","Oklahoma City","OK","73108","Surgery","MARTHA,  DOVIE",null,null,"YES","5","NONE","1","More than 2"]
["MARY,  GEMMA","Barbara Green","O50413","GEMMA","MARY","227 Delmar Ave","Pensacola","FL","32598","GP","MARY,  GEMMA"]
["MARYETTA,  ARACELIS","Barbara Green","O58940","ARACELIS","MARYETTA","4621 160th Ave","Bayville","ME","04536","GP","MARYETTA,  ARACELIS"]
["MAURICE,  KIRK","Barbara Green","O67681","KIRK","MAURICE","1422 Merry St","Coffee Springs","AL","36318","GP","MAURICE,  KIRK"]
["MCKENZIE,  MARILEE","Barbara Green","O65237","MARILEE","MCKENZIE","4462 276th St","Marston","NC","28363","GP","MCKENZIE,  MARILEE"]
["MEGAN,  AYESHA","Barbara Green","O65732","AYESHA","MEGAN","105th Floor, 2804 Jeannine Wy","Dayton","OH","45459","Ortho","MEGAN,  AYESHA"]
["MELIA,  WONDA","Barbara Green","O70924","WONDA","MELIA","2328 Gil Wy","Presque Isle","MI","49777","Ortho","MELIA,  WONDA"]
["MELISSA,  JOANE","Barbara Green","O66805","JOANE","MELISSA","4629 Kendall St","Chickasha","OK","73023","Surgery","MELISSA,  JOANE"]
["MELLISSA,  MYRTLE","Barbara Green","O50769","MYRTLE","MELLISSA","Unit 8, 736 240th St","Itta Bena","MS","38941","GP","MELLISSA,  MYRTLE"]
["MELVIN,  GENA","Barbara Green","O56579","GENA","MELVIN","1966 147th St","Tall Timbers","MD","20690","Surgery","MELVIN,  GENA"]
["MERILYN,  LENNY","Barbara Green","O59301","LENNY","MERILYN","26 172nd St","Levering","MI","49755","GP","MERILYN,  LENNY"]
["MICHA,  LOURA","Barbara Green","O63045","LOURA","MICHA","1005 285th Ave","Sacramento","CA","94289","Ortho","MICHA,  LOURA"]
["MICHAL,  EVITA","Barbara Green","O69416","EVITA","MICHAL","2638 Dann St","Monticello","FL","32345","Ortho","MICHAL,  EVITA"]
["MIGNON,  FELICIA","Barbara Green","O72558","FELICIA","MIGNON","Unit 7, 2077 153rd Ave","Sioux Falls","SD","57105","GP","MIGNON,  FELICIA",null,null,"YES","1 - 2","NONE","1","2 or Less"]
["MITCHELL,  MOZELLA","Barbara Green","O75619","MOZELLA","MITCHELL","1008 Garret St","Palm Bay","FL","32911","Ortho","MITCHELL,  MOZELLA",null,null,"YES","1 - 2","NONE","1","2 or Less"]
["MITSUKO,  LATOSHA","Barbara Green","O74997","LATOSHA","MITSUKO","136 Glennie St","Grayland","WA","98547","GP","MITSUKO,  LATOSHA"]
["MODESTO,  VIRGILIO","Barbara Green","O56879","VIRGILIO","MODESTO","4372 Evan Ave","Steeleville","IL","62288","GP","MODESTO,  VIRGILIO"]
["NAKISHA,  BRETT","Barbara Green","O75346","BRETT","NAKISHA","4915 Mack St","Bella Vista","CA","96008","GP","NAKISHA,  BRETT"]
["NICHOLAS,  IONE","Barbara Green","O77873","IONE","NICHOLAS","3458 Carroll St","Shokan","NY","12481","GP","NICHOLAS,  IONE"]
["OK,  DONOVAN","Barbara Green","O75848","DONOVAN","OK","2112 Stefanie St","Blacksburg","VA","24060","GP","OK,  DONOVAN"]
["OPAL,  JERICA","Barbara Green","O77215","JERICA","OPAL","928 Clementine St","Flossmoor","IL","60422","GP","OPAL,  JERICA"]
["PARIS,  ANGELE","Barbara Green","O77382","ANGELE","PARIS","3765 Jamey St","Mendenhall","PA","19357","GP","PARIS,  ANGELE"]
["PAT,  BECKI","Barbara Green","O56548","BECKI","PAT","2nd Floor, 3847 268th Ave","South Barre","MA","01074","GP","PAT,  BECKI"]
["PATTI,  OSCAR","Barbara Green","O77476","OSCAR","PATTI","2192 Carole Pl","Dickerson Run","PA","15430","GP","PATTI,  OSCAR"]
["PAUL,  MARSHALL","Barbara Green","O64022","MARSHALL","PAUL","19 Reba Ave","Sewanee","TN","37383","Ortho","PAUL,  MARSHALL"]
["PAULA,  GAY","Barbara Green","O79857","GAY","PAULA","3578 Earnestine St","Gregory","TX","78359","GP","PAULA,  GAY"]
["PETRINA,  PHYLIS","Barbara Green","O55090","PHYLIS","PETRINA","3576 Waldo Ave","Beckley","WV","25802","Surgery","PETRINA,  PHYLIS"]
["PHYLISS,  CONNIE","Barbara Green","O63455","CONNIE","PHYLISS","2745 14th Ave","Onslow","IA","52321","GP","PHYLISS,  CONNIE"]
["PRESTON,  JOHANNE","Barbara Green","O64535","JOHANNE","PRESTON","537 Phuong St","Glen Oaks","NY","11004","GP","PRESTON,  JOHANNE"]
["PRISCILLA,  ANDRA","Barbara Green","O69710","ANDRA","PRISCILLA","963 198th St","Kirwin","KS","67644","GP","PRISCILLA,  ANDRA"]
["QIANA,  LORA","Barbara Green","O79994","LORA","QIANA","644 Kaycee Ave","Vienna","VA","22180","GP","QIANA,  LORA"]
["RENATO,  JEANNETTA","Barbara Green","O66775","JEANNETTA","RENATO","Apt 4, 1208 Petronila Ave","Rocky Mount","NC","27804","Surgery","RENATO,  JEANNETTA"]
["RENAY,  FRANCENE","Barbara Green","O52275","FRANCENE","RENAY","4239 Desire Ave","Minnetonka Beach","MN","55361","Ortho","RENAY,  FRANCENE"]
["RIA,  JOSPHINE","Barbara Green","O68628","JOSPHINE","RIA","244 155th Ave","Bellingham","MA","02019","GP","RIA,  JOSPHINE"]
["RICKI,  SHERLEY","Barbara Green","O76414","SHERLEY","RICKI","3498 262nd St","San Diego","CA","92116","Ortho","RICKI,  SHERLEY"]
["ROD,  KENNY","Barbara Green","O73212","KENNY","ROD","Unit 19Z, 2283 Willis Ave","Pine Grove","CA","95665","Surgery","ROD,  KENNY"]
["ROLANDO,  JANISE","Barbara Green","O52775","JANISE","ROLANDO","903 Jeanmarie St","West Dover","VT","05356","GP","ROLANDO,  JANISE"]
["RONALD,  DANILLE","Barbara Green","O51562","DANILLE","RONALD","Offc 3P, 4943 Cedric St","Lancaster","PA","17608","GP","RONALD,  DANILLE"]
["RONNA,  EDEN","Barbara Green","O54106","EDEN","RONNA","Offc 14, 297 Homer Ave","Norwalk","CT","06858","GP","RONNA,  EDEN"]
["ROSELINE,  ANGELINA","Barbara Green","O57029","ANGELINA","ROSELINE","1608 240th St","Thayne","WY","83127","GP","ROSELINE,  ANGELINA"]
["ROSIE,  MADELINE","Barbara Green","O63058","MADELINE","ROSIE","2775 Yen Cswy","Louisville","GA","30434","GP","ROSIE,  MADELINE"]
["ROYCE,  TAMMY","Barbara Green","O65869","TAMMY","ROYCE","9th Floor, 2444 Lizzie St","Points","WV","25437","Ortho","ROYCE,  TAMMY"]
["RUEBEN,  DORLA","Barbara Green","O60894","DORLA","RUEBEN","1402 Laurel St","Esom Hill","GA","30138","Surgery","RUEBEN,  DORLA"]
["RUTHE,  HILDEGARD","Barbara Green","O67433","HILDEGARD","RUTHE","3992 Selina Ave","Bennington","IN","47011","GP","RUTHE,  HILDEGARD"]
["SALINA,  CORINA","Barbara Green","O63730","CORINA","SALINA","2nd Floor, 2837 Janyce Pkwy","Phoenix","AZ","85080","Ortho","SALINA,  CORINA"]
["SANDRA,  TORY","Barbara Green","O23768","TORY","SANDRA","345 Dallas Crsg","Belleville","WV","26133","GP","SANDRA,  TORY"]
["SAVANNA,  ASIA","Barbara Green","O62841","ASIA","SAVANNA","41st Floor, 504 Aleta Ave","Santa Ana","CA","92711","GP","SAVANNA,  ASIA"]
["SCOTT,  JONELL","Barbara Green","O71224","JONELL","SCOTT","Unit 1, 1582 Prince St","Bee Branch","AR","72013","GP","SCOTT,  JONELL"]
["SELMA,  TAMMARA","Barbara Green","O60441","TAMMARA","SELMA","4350 Bette St","Mount Cory","OH","45868","GP","SELMA,  TAMMARA"]
["SHALONDA,  MORGAN","Barbara Green","O55057","MORGAN","SHALONDA","290 255th Ave","Mount Sterling","WI","54645","GP","SHALONDA,  MORGAN"]
["SHAMIKA,  ARMAND","Barbara Green","O68970","ARMAND","SHAMIKA","4413 Neil St","Topeka","KS","66624","GP","SHAMIKA,  ARMAND"]
["SHANELLE,  HAYDEN","Barbara Green","O65078","HAYDEN","SHANELLE","3412 Margy Ave","Glenbrook","NV","89413","Ortho","SHANELLE,  HAYDEN"]
["SHANTI,  ANGEL","Barbara Green","O68876","ANGEL","SHANTI","1895 5th Ave","Point Roberts","WA","98281","Ortho","SHANTI,  ANGEL"]
["SHARYL,  DANNIE","Barbara Green","O77679","DANNIE","SHARYL","3095 279th St","Lantry","SD","57636","GP","SHARYL,  DANNIE"]
["SHAVON,  STACIA","Barbara Green","O53179","STACIA","SHAVON","Apt 15, 4930 111st Ave","El Paso","TX","88565","GP","SHAVON,  STACIA"]
["SHAWANNA,  DEDRA","Barbara Green","O52953","DEDRA","SHAWANNA","10th Floor, 1927 Scott Ave","Woburn","MA","01807","GP","SHAWANNA,  DEDRA"]
["SHEILA,  ROCCO","Barbara Green","O79508","ROCCO","SHEILA","1425 Connie Conc","Miami","FL","33266","Surgery","SHEILA,  ROCCO"]
["SHELBY,  LUZ","Barbara Green","O79658","LUZ","SHELBY","3541 Charley St","Morenci","AZ","85540","Surgery","SHELBY,  LUZ"]
["SHONTA,  HOLLIS","Barbara Green","O59469","HOLLIS","SHONTA","Unit 2, 3155 150th St","Hemingford","NE","69348","Surgery","SHONTA,  HOLLIS"]
["STEPHEN,  JOAN","Barbara Green","O57857","JOAN","STEPHEN","3195 100th Ave","Tonto Basin","AZ","85553","GP","STEPHEN,  JOAN"]
["SU,  ALDA","Barbara Green","O62663","ALDA","SU","1836 226th Ave","Screven","GA","31560","GP","SU,  ALDA"]
["SUMMER,  MILLY","Barbara Green","O63153","MILLY","SUMMER","2611 Wilma Ave","Indianapolis","IN","46236","Surgery","SUMMER,  MILLY"]
["SUNNI,  RETTA","Barbara Green","O71629","RETTA","SUNNI","18 Armida Ave","Amador City","CA","95601","Ortho","SUNNI,  RETTA"]
["TAD,  APOLONIA","Barbara Green","O75270","APOLONIA","TAD","226 Chuck St","Oak Creek","WI","53154","Ortho","TAD,  APOLONIA"]
["TAMESHA,  JANEEN","Barbara Green","O79087","JANEEN","TAMESHA","4618 Kyra Ave","Stinesville","IN","47464","GP","TAMESHA,  JANEEN"]
["TAMMERA,  CARMELO","Barbara Green","O61106","CARMELO","TAMMERA","76th Floor, 1775 221st Ave","Raleigh","NC","27619","Surgery","TAMMERA,  CARMELO"]
["TAMRA,  CARLOS","Barbara Green","O59613","CARLOS","TAMRA","3593 Roseanna Ct","Gypsy","WV","26361","GP","TAMRA,  CARLOS"]
["TATUM,  MICHAEL","Barbara Green","O75200","MICHAEL","TATUM","18 Rosa Trnpk","Sautee Nacoochee","GA","30571","Surgery","TATUM,  MICHAEL"]
["TAWNA,  ARNULFO","Barbara Green","O51510","ARNULFO","TAWNA","4982 Kathy Ave","Chattanooga","TN","37406","GP","TAWNA,  ARNULFO"]
["TAWNYA,  LOLA","Barbara Green","O62116","LOLA","TAWNYA","501 Nicholas Ave","Philadelphia","PA","19184","Ortho","TAWNYA,  LOLA"]
["TEREASA,  GONZALO","Barbara Green","O50398","GONZALO","TEREASA","2692 Yer Ave","Economy","IN","47339","Ortho","TEREASA,  GONZALO"]
["TESHA,  MAE","Barbara Green","O50349","MAE","TESHA","99th Floor, 1212 79th Ave","New Port Richey","FL","34655","GP","TESHA,  MAE"]
["TIMOTHY,  ALETHA","Barbara Green","O51630","ALETHA","TIMOTHY","126th Floor, 1626 Lisha Ave","Waltham","MA","02453","Surgery","TIMOTHY,  ALETHA"]
["TORIE,  LASONYA","Barbara Green","O67533","LASONYA","TORIE","638 Andra Ave","Lac Du Flambeau","WI","54538","GP","TORIE,  LASONYA"]
["TRENTON,  TARYN","Barbara Green","O50289","TARYN","TRENTON","3445 Kayleigh Pkwy","Fredericksburg","TX","78624","Ortho","TRENTON,  TARYN"]
["TYLER,  LILIA","Barbara Green","O63169","LILIA","TYLER","624 Chere Ave","Savoy","MA","01256","GP","TYLER,  LILIA"]
["VEDA,  CAROYLN","Barbara Green","O60298","CAROYLN","VEDA","610 Arlene Ave","Cordova","IL","61242","GP","VEDA,  CAROYLN"]
["VERNIA,  KRISTOPHER","Barbara Green","O68378","KRISTOPHER","VERNIA","11st Floor, 4928 Tierra Pl","Paris","TN","38242","GP","VERNIA,  KRISTOPHER"]
["VERNIE,  FELICA","Barbara Green","O54408","FELICA","VERNIE","Offc 7, 3479 Aron Ave","Buckley","MI","49620","GP","VERNIE,  FELICA"]
["VERSIE,  ZACHARY","Barbara Green","O51548","ZACHARY","VERSIE","1474 Kevin Ave","Copper Center","AK","99573","GP","VERSIE,  ZACHARY"]
["VIOLA,  LORILEE","Barbara Green","O71381","LORILEE","VIOLA","2825 8th Ave","Plains","TX","79355","Ortho","VIOLA,  LORILEE"]
["WALTON,  TAD","Barbara Green","O51679","TAD","WALTON","1797 Raul Trnpk","Calpella","CA","95418","Ortho","WALTON,  TAD"]
["WAN,  SHIRLEEN","Barbara Green","O79950","SHIRLEEN","WAN","1947 Hertha Ave","Rosanky","TX","78953","Ortho","WAN,  SHIRLEEN",null,null,"YES","1 - 2","1 - 3","1","2 or Less"]
["YASMINE,  JOHN","Barbara Green","O50941","JOHN","YASMINE","592 Jayme St","Pacific","MO","63069","Surgery","YASMINE,  JOHN"]
["ZETTA,  ROLF","Barbara Green","O74758","ROLF","ZETTA","1600 Dan St","Beauty","KY","41203","GP","ZETTA,  ROLF",null,null,"YES","NONE","1 - 3","2 - 3","2 or Less"]
["ZOE,  ADELA","Barbara Green","O78290","ADELA","ZOE","3048 Cherise Ave","Forreston","IL","61030","GP","ZOE,  ADELA"]
["ZORA,  LAWRENCE","Barbara Green","O56721","LAWRENCE","ZORA","4921 Gloria Ave","Ace","TX","77326","Ortho","ZORA,  LAWRENCE"]

{"sheet":"Calculate","index":2,"n_rows":25,"n_cols":19,"rows_kept":25,"cut":false,"hidden":true,"merged":[]}
[null,null,null,null,null,null,null,null,null,null,null,{"$f":"\"Rep_Data!N\"&Calculate!$K$3&\":R\"&Calculate!$K$3","v":"Rep_Data!N3:R3"}]
["Physician Name","Name of the Rep","Physician ID","First Name","Last Name","Street Address 1"," City"," State"," Zip","Speciality","Row No","Filled ",null,null,"Q1","Q2","Q3","Q4","Q5"]
["AARON,  DOMITILA",{"$f":"VLOOKUP($A3,Rep_Data!$A$3:$J$252,2,0)","v":"Barbara Green"},{"$f":"VLOOKUP($A3,Rep_Data!$A$3:$J$252,3,0)","v":"O65016"},{"$f":"VLOOKUP($A3,Rep_Data!$A$3:$J$252,4,0)","v":"DOMITILA"},{"$f":"VLOOKUP($A3,Rep_Data!$A$3:$J$252,5,0)","v":"AARON"},{"$f":"VLOOKUP($A3,Rep_Data!$A$3:$J$252,6,0)","v":"4605 Patti St"},{"$f":"VLOOKUP($A3,Rep_Data!$A$3:$J$252,7,0)","v":"Hampton"},{"$f":"VLOOKUP($A3,Rep_Data!$A$3:$J$252,8,0)","v":"VA"},{"$f":"VLOOKUP($A3,Rep_Data!$A$3:$J$252,9,0)","v":"23681"},{"$f":"VLOOKUP($A3,Rep_Data!$A$3:$J$252,10,0)","v":"GP"},{"$f":"MATCH(A3,Rep_Data!$A$3:$A$252) +2","v":3},{"$f":"IF(O3=\"\",0,COUNTA(INDIRECT(L1)))","v":5},null,null,{"$f":"VLOOKUP($A3,Rep_Data!$A$3:$R$252,14,0)","v":"NO"},{"$f":"VLOOKUP($A3,Rep_Data!$A$3:$R$252,15,0)","v":"NONE"},{"$f":"VLOOKUP($A3,Rep_Data!$A$3:$R$252,16,0)","v":"NONE"},{"$f":"VLOOKUP($A3,Rep_Data!$A$3:$R$252,17,0)","v":"1"},{"$f":"VLOOKUP($A3,Rep_Data!$A$3:$R$252,18,0)","v":"2 or Less"}]
[]
[]
[]
[]
[]
[]
[]
[]
[]
[]
[]
[]
[]
[{"$f":"COUNTIF($A$18:$E$18,\"SELECT\")","v":0}]
["NO","NONE","NONE","1","2 or Less",null,null,"All","GP","Ortho","Surgery"]
[null,null,null,null,null,null,"Total",{"$f":"COUNTA(Table1[Physician Name])","v":250},{"$f":"COUNTIF(Table1[Speciality],Calculate!I$18)","v":155},{"$f":"COUNTIF(Table1[Speciality],Calculate!J$18)","v":52},{"$f":"COUNTIF(Table1[Speciality],Calculate!K$18)","v":43}]
["Q1","Q2","Q3","Q4","Q5",null,"Filled",{"$f":"H19-H21","v":47},{"$f":"I19-I21","v":27},11,9]
["SELECT","SELECT","SELECT","SELECT","SELECT",null,"Unfilled",{"$f":"SUM(I21:K21)","v":203},{"$f":"COUNTIF(Summary!$AA$4:$AA$253,\"GP-\")","v":128},{"$f":"COUNTIF(Summary!$AA$4:$AA$253,\"Ortho-\")","v":41},{"$f":"COUNTIF(Summary!$AA$4:$AA$253,\"Surgery-\")","v":34}]
["YES","NONE","NONE","1","2 or Less"]
["NO","1 - 2","1 - 3","2 - 3","More than 2"]
[null,"3 - 4","3 - 5","More than 3"]
[null,"5"]

{"sheet":"Summary","index":3,"n_rows":253,"n_cols":27,"rows_kept":253,"cut":false,"hidden":false,"merged":[[1,8,1,12]]}
[]
[null,null,null,null,null,null,null,null,"RESPONSES TO THE QUESTIONNAIRE"]
[null,"S. No","Physician Name","Physician ID"," City"," State"," Zip","Speciality","Q1","Q2","Q3","Q4","Q5"]
[null,1,{"$f":"Rep_Data!A3","v":"AARON,  DOMITILA"},{"$f":"Rep_Data!C3","v":"O65016"},{"$f":"Rep_Data!G3","v":"Hampton"},{"$f":"Rep_Data!H3","v":"VA"},{"$f":"Rep_Data!I3","v":"23681"},{"$f":"Rep_Data!J3","v":"GP"},{"$f":"IF(Rep_Data!N3 = 0, \"-\",IF(Rep_Data!N3 = \"\",\"-\",Rep_Data!N3))","v":"NO"},{"$f":"IF(Rep_Data!O3 = 0, \"-\",IF(Rep_Data!O3 = \"\",\"-\",Rep_Data!O3))","v":"NONE"},{"$f":"IF(Rep_Data!P3 = 0, \"-\",IF(Rep_Data!P3 = \"\",\"-\",Rep_Data!P3))","v":"NONE"},{"$f":"IF(Rep_Data!Q3 = 0, \"-\",IF(Rep_Data!Q3 = \"\",\"-\",Rep_Data!Q3))","v":"1"},{"$f":"IF(Rep_Data!R3 = 0, \"-\",IF(Rep_Data!R3 = \"\",\"-\",Rep_Data!R3))","v":"2 or Less"},null,null,null,null,null,null,null,null,null,null,null,null,null,{"$f":"Table1[[#This Row],[Speciality]]&Table1[[#This Row],[Q1]]","v":"GPNO"}]
[null,2,{"$f":"Rep_Data!A4","v":"ABIGAIL,  JAMISON"},{"$f":"Rep_Data!C4","v":"O76771"},{"$f":"Rep_Data!G4","v":"Ferndale"},{"$f":"Rep_Data!H4","v":"FL"},{"$f":"Rep_Data!I4","v":"34729"},{"$f":"Rep_Data!J4","v":"GP"},{"$f":"IF(Rep_Data!N4 = 0, \"-\",IF(Rep_Data!N4 = \"\",\"-\",Rep_Data!N4))","v":"-"},{"$f":"IF(Rep_Data!O4 = 0, \"-\",IF(Rep_Data!O4 = \"\",\"-\",Rep_Data!O4))","v":"-"},{"$f":"IF(Rep_Data!P4 = 0, \"-\",IF(Rep_Data!P4 = \"\",\"-\",Rep_Data!P4))","v":"-"},{"$f":"IF(Rep_Data!Q4 = 0, \"-\",IF(Rep_Data!Q4 = \"\",\"-\",Rep_Data!Q4))","v":"-"},{"$f":"IF(Rep_Data!R4 = 0, \"-\",IF(Rep_Data!R4 = \"\",\"-\",Rep_Data!R4))","v":"-"},null,null,null,null,null,null,null,null,null,null,null,null,null,{"$f":"Table1[[#This Row],[Speciality]]&Table1[[#This Row],[Q1]]","v":"GP-"}]
[null,3,{"$f":"Rep_Data!A5","v":"AI,  LAKEESHA"},{"$f":"Rep_Data!C5","v":"O68016"},{"$f":"Rep_Data!G5","v":"Boca Raton"},{"$f":"Rep_Data!H5","v":"FL"},{"$f":"Rep_Data!I5","v":"33428"},{"$f":"Rep_Data!J5","v":"Ortho"},{"$f":"IF(Rep_Data!N5 = 0, \"-\",IF(Rep_Data!N5 = \"\",\"-\",Rep_Data!N5))","v":"-"},{"$f":"IF(Rep_Data!O5 = 0, \"-\",IF(Rep_Data!O5 = \"\",\"-\",Rep_Data!O5))","v":"-"},{"$f":"IF(Rep_Data!P5 = 0, \"-\",IF(Rep_Data!P5 = \"\",\"-\",Rep_Data!P5))","v":"-"},{"$f":"IF(Rep_Data!Q5 = 0, \"-\",IF(Rep_Data!Q5 = \"\",\"-\",Rep_Data!Q5))","v":"-"},{"$f":"IF(Rep_Data!R5 = 0, \"-\",IF(Rep_Data!R5 = \"\",\"-\",Rep_Data!R5))","v":"-"},null,null,null,null,null,null,null,null,null,null,null,null,null,{"$f":"Table1[[#This Row],[Speciality]]&Table1[[#This Row],[Q1]]","v":"Ortho-"}]
[null,4,{"$f":"Rep_Data!A6","v":"ALBERT,  ALI"},{"$f":"Rep_Data!C6","v":"O65520"},{"$f":"Rep_Data!G6","v":"Stockbridge"},{"$f":"Rep_Data!H6","v":"GA"},{"$f":"Rep_Data!I6","v":"30281"},{"$f":"Rep_Data!J6","v":"GP"},{"$f":"IF(Rep_Data!N6 = 0, \"-\",IF(Rep_Data!N6 = \"\",\"-\",Rep_Data!N6))","v":"YES"},{"$f":"IF(Rep_Data!O6 = 0, \"-\",IF(Rep_Data!O6 = \"\",\"-\",Rep_Data!O6))","v":"3 - 4"},{"$f":"IF(Rep_Data!P6 = 0, \"-\",IF(Rep_Data!P6 = \"\",\"-\",Rep_Data!P6))","v":"3 - 5"},{"$f":"IF(Rep_Data!Q6 = 0, \"-\",IF(Rep_Data!Q6 = \"\",\"-\",Rep_Data!Q6))","v":"2 - 3"},{"$f":"IF(Rep_Data!R6 = 0, \"-\",IF(Rep_Data!R6 = \"\",\"-\",Rep_Data!R6))","v":"2 or Less"},null,null,null,null,null,null,null,null,null,null,null,null,null,{"$f":"Table1[[#This Row],[Speciality]]&Table1[[#This Row],[Q1]]","v":"GPYES"}]
[null,5,{"$f":"Rep_Data!A7","v":"ALBERTHA,  BRIGETTE"},{"$f":"Rep_Data!C7","v":"O58834"},{"$f":"Rep_Data!G7","v":"Bridgeton"},{"$f":"Rep_Data!H7","v":"IN"},{"$f":"Rep_Data!I7","v":"47836"},{"$f":"Rep_Data!J7","v":"Surgery"},{"$f":"IF(Rep_Data!N7 = 0, \"-\",IF(Rep_Data!N7 = \"\",\"-\",Rep_Data!N7))","v":"YES"},{"$f":"IF(Rep_Data!O7 = 0, \"-\",IF(Rep_Data!O7 = \"\",\"-\",Rep_Data!O7))","v":"3 - 4"},{"$f":"IF(Rep_Data!P7 = 0, \"-\",IF(Rep_Data!P7 = \"\",\"-\",Rep_Data!P7))","v":"1 - 3"},{"$f":"IF(Rep_Data!Q7 = 0, \"-\",IF(Rep_Data!Q7 = \"\",\"-\",Rep_Data!Q7))","v":"More than 3"},{"$f":"IF(Rep_Data!R7 = 0, \"-\",IF(Rep_Data!R7 = \"\",\"-\",Rep_Data!R7))","v":"More than 2"},null,null,null,null,null,null,null,null,null,null,null,null,null,{"$f":"Table1[[#This Row],[Speciality]]&Table1[[#This Row],[Q1]]","v":"SurgeryYES"}]
[null,6,{"$f":"Rep_Data!A8","v":"ALISA,  KRYSTYNA"},{"$f":"Rep_Data!C8","v":"O59647"},{"$f":"Rep_Data!G8","v":"Greenwood Springs"},{"$f":"Rep_Data!H8","v":"MS"},{"$f":"Rep_Data!I8","v":"38848"},{"$f":"Rep_Data!J8","v":"GP"},{"$f":"IF(Rep_Data!N8 = 0, \"-\",IF(Rep_Data!N8 = \"\",\"-\",Rep_Data!N8))","v":"-"},{"$f":"IF(Rep_Data!O8 = 0, \"-\",IF(Rep_Data!O8 = \"\",\"-\",Rep_Data!O8))","v":"-"},{"$f":"IF(Rep_Data!P8 = 0, \"-\",IF(Rep_Data!P8 = \"\",\"-\",Rep_Data!P8))","v":"-"},{"$f":"IF(Rep_Data!Q8 = 0, \"-\",IF(Rep_Data!Q8 = \"\",\"-\",Rep_Data!Q8))","v":"-"},{"$f":"IF(Rep_Data!R8 = 0, \"-\",IF(Rep_Data!R8 = \"\",\"-\",Rep_Data!R8))","v":"-"},null,null,null,null,null,null,null,null,null,null,null,null,null,{"$f":"Table1[[#This Row],[Speciality]]&Table1[[#This Row],[Q1]]","v":"GP-"}]
[null,7,{"$f":"Rep_Data!A9","v":"ALTON,  THANH"},{"$f":"Rep_Data!C9","v":"O61755"},{"$f":"Rep_Data!G9","v":"Summitville"},{"$f":"Rep_Data!H9","v":"NY"},{"$f":"Rep_Data!I9","v":"12781"},{"$f":"Rep_Data!J9","v":"Ortho"},{"$f":"IF(Rep_Data!N9 = 0, \"-\",IF(Rep_Data!N9 = \"\",\"-\",Rep_Data!N9))","v":"YES"},{"$f":"IF(Rep_Data!O9 = 0, \"-\",IF(Rep_Data!O9 = \"\",\"-\",Rep_Data!O9))","v":"3 - 4"},{"$f":"IF(Rep_Data!P9 = 0, \"-\",IF(Rep_Data!P9 = \"\",\"-\",Rep_Data!P9))","v":"3 - 5"},{"$f":"IF(Rep_Data!Q9 = 0, \"-\",IF(Rep_Data!Q9 = \"\",\"-\",Rep_Data!Q9))","v":"2 - 3"},{"$f":"IF(Rep_Data!R9 = 0, \"-\",IF(Rep_Data!R9 = \"\",\"-\",Rep_Data!R9))","v":"More than 2"},null,null,null,null,null,null,null,null,null,null,null,null,null,{"$f":"Table1[[#This Row],[Speciality]]&Table1[[#This Row],[Q1]]","v":"OrthoYES"}]
[null,8,{"$f":"Rep_Data!A10","v":"ALVINA,  ERNIE"},{"$f":"Rep_Data!C10","v":"O71265"},{"$f":"Rep_Data!G10","v":"Wilton"},{"$f":"Rep_Data!H10","v":"CT"},{"$f":"Rep_Data!I10","v":"06897"},{"$f":"Rep_Data!J10","v":"GP"},{"$f":"IF(Rep_Data!N10 = 0, \"-\",IF(Rep_Data!N10 = \"\",\"-\",Rep_Data!N10))","v":"-"},{"$f":"IF(Rep_Data!O10 = 0, \"-\",IF(Rep_Data!O10 = \"\",\"-\",Rep_Data!O10))","v":"-"},{"$f":"IF(Rep_Data!P10 = 0, \"-\",IF(Rep_Data!P10 = \"\",\"-\",Rep_Data!P10))","v":"-"},{"$f":"IF(Rep_Data!Q10 = 0, \"-\",IF(Rep_Data!Q10 = \"\",\"-\",Rep_Data!Q10))","v":"-"},{"$f":"IF(Rep_Data!R10 = 0, \"-\",IF(Rep_Data!R10 = \"\",\"-\",Rep_Data!R10))","v":"-"},null,null,null,null,null,null,null,null,null,null,null,null,null,{"$f":"Table1[[#This Row],[Speciality]]&Table1[[#This Row],[Q1]]","v":"GP-"}]
[null,9,{"$f":"Rep_Data!A11","v":"ALYSIA,  SHERILYN"},{"$f":"Rep_Data!C11","v":"O63685"},{"$f":"Rep_Data!G11","v":"Earth"},{"$f":"Rep_Data!H11","v":"TX"},{"$f":"Rep_Data!I11","v":"79031"},{"$f":"Rep_Data!J11","v":"GP"},{"$f":"IF(Rep_Data!N11 = 0, \"-\",IF(Rep_Data!N11 = \"\",\"-\",Rep_Data!N11))","v":"-"},{"$f":"IF(Rep_Data!O11 = 0, \"-\",IF(Rep_Data!O11 = \"\",\"-\",Rep_Data!O11))","v":"-"},{"$f":"IF(Rep_Data!P11 = 0, \"-\",IF(Rep_Data!P11 = \"\",\"-\",Rep_Data!P11))","v":"-"},{"$f":"IF(Rep_Data!Q11 = 0, \"-\",IF(Rep_Data!Q11 = \"\",\"-\",Rep_Data!Q11))","v":"-"},{"$f":"IF(Rep_Data!R11 = 0, \"-\",IF(Rep_Data!R11 = \"\",\"-\",Rep_Data!R11))","v":"-"},null,null,null,null,null,null,null,null,null,null,null,null,null,{"$f":"Table1[[#This Row],[Speciality]]&Table1[[#This Row],[Q1]]","v":"GP-"}]
[null,10,{"$f":"Rep_Data!A12","v":"ANDRE,  YVONNE"},{"$f":"Rep_Data!C12","v":"O63747"},{"$f":"Rep_Data!G12","v":"Independence"},{"$f":"Rep_Data!H12","v":"MO"},{"$f":"Rep_Data!I12","v":"64056"},{"$f":"Rep_Data!J12","v":"Surgery"},{"$f":"IF(Rep_Data!N12 = 0, \"-\",IF(Rep_Data!N12 = \"\",\"-\",Rep_Data!N12))","v":"NO"},{"$f":"IF(Rep_Data!O12 = 0, \"-\",IF(Rep_Data!O12 = \"\",\"-\",Rep_Data!O12))","v":"3 - 4"},{"$f":"IF(Rep_Data!P12 = 0, \"-\",IF(Rep_Data!P12 = \"\",\"-\",Rep_Data!P12))","v":"1 - 3"},{"$f":"IF(Rep_Data!Q12 = 0, \"-\",IF(Rep_Data!Q12 = \"\",\"-\",Rep_Data!Q12))","v":"2 - 3"},{"$f":"IF(Rep_Data!R12 = 0, \"-\",IF(Rep_Data!R12 = \"\",\"-\",Rep_Data!R12))","v":"2 or Less"},null,null,null,null,null,null,null,null,null,null,null,null,null,{"$f":"Table1[[#This Row],[Speciality]]&Table1[[#This Row],[Q1]]","v":"SurgeryNO"}]
[null,11,{"$f":"Rep_Data!A13","v":"ANDREA,  NICKIE"},{"$f":"Rep_Data!C13","v":"O79689"},{"$f":"Rep_Data!G13","v":"Bathgate"},{"$f":"Rep_Data!H13","v":"ND"},{"$f":"Rep_Data!I13","v":"58216"},{"$f":"Rep_Data!J13","v":"Surgery"},{"$f":"IF(Rep_Data!N13 = 0, \"-\",IF(Rep_Data!N13 = \"\",\"-\",Rep_Data!N13))","v":"NO"},{"$f":"IF(Rep_Data!O13 = 0, \"-\",IF(Rep_Data!O13 = \"\",\"-\",Rep_Data!O13))","v":"1 - 2"},{"$f":"IF(Rep_Data!P13 = 0, \"-\",IF(Rep_Data!P13 = \"\",\"-\",Rep_Data!P13))","v":"NONE"},{"$f":"IF(Rep_Data!Q13 = 0, \"-\",IF(Rep_Data!Q13 = \"\",\"-\",Rep_Data!Q13))","v":"2 - 3"},{"$f":"IF(Rep_Data!R13 = 0, \"-\",IF(Rep_Data!R13 = \"\",\"-\",Rep_Data!R13))","v":"More than 2"},null,null,null,null,null,null,null,null,null,null,null,null,null,{"$f":"Table1[[#This Row],[Speciality]]&Table1[[#This Row],[Q1]]","v":"SurgeryNO"}]
[null,12,{"$f":"Rep_Data!A14","v":"ANGELO,  SHONDRA"},{"$f":"Rep_Data!C14","v":"O75260"},{"$f":"Rep_Data!G14","v":"Kansas City"},{"$f":"Rep_Data!H14","v":"MO"},{"$f":"Rep_Data!I14","v":"64110"},{"$f":"Rep_Data!J14","v":"Ortho"},{"$f":"IF(Rep_Data!N14 = 0, \"-\",IF(Rep_Data!N14 = \"\",\"-\",Rep_Data!N14))","v":"YES"},{"$f":"IF(Rep_Data!O14 = 0, \"-\",IF(Rep_Data!O14 = \"\",\"-\",Rep_Data!O14))","v":"1 - 2"},{"$f":"IF(Rep_Data!P14 = 0, \"-\",IF(Rep_Data!P14 = \"\",\"-\",Rep_Data!P14))","v":"NONE"},{"$f":"IF(Rep_Data!Q14 = 0, \"-\",IF(Rep_Data!Q14 = \"\",\"-\",Rep_Data!Q14))","v":"1"},{"$f":"IF(Rep_Data!R14 = 0, \"-\",IF(Rep_Data!R14 = \"\",\"-\",Rep_Data!R14))","v":"2 or Less"},null,null,null,null,null,null,null,null,null,null,null,null,null,{"$f":"Table1[[#This Row],[Speciality]]&Table1[[#This Row],[Q1]]","v":"OrthoYES"}]
[null,13,{"$f":"Rep_Data!A15","v":"ANITRA,  STEPANIE"},{"$f":"Rep_Data!C15","v":"O61474"},{"$f":"Rep_Data!G15","v":"Pacific Grove"},{"$f":"Rep_Data!H15","v":"CA"},{"$f":"Rep_Data!I15","v":"93950"},{"$f":"Rep_Data!J15","v":"GP"},{"$f":"IF(Rep_Data!N15 = 0, \"-\",IF(Rep_Data!N15 = \"\",\"-\",Rep_Data!N15))","v":"-"},{"$f":"IF(Rep_Data!O15 = 0, \"-\",IF(Rep_Data!O15 = \"\",\"-\",Rep_Data!O15))","v":"-"},{"$f":"IF(Rep_Data!P15 = 0, \"-\",IF(Rep_Data!P15 = \"\",\"-\",Rep_Data!P15))","v":"-"},{"$f":"IF(Rep_Data!Q15 = 0, \"-\",IF(Rep_Data!Q15 = \"\",\"-\",Rep_Data!Q15))","v":"-"},{"$f":"IF(Rep_Data!R15 = 0, \"-\",IF(Rep_Data!R15 = \"\",\"-\",Rep_Data!R15))","v":"-"},null,null,null,null,null,null,null,null,null,null,null,null,null,{"$f":"Table1[[#This Row],[Speciality]]&Table1[[#This Row],[Q1]]","v":"GP-"}]
[null,14,{"$f":"Rep_Data!A16","v":"ANTIONE,  MARC"},{"$f":"Rep_Data!C16","v":"O79277"},{"$f":"Rep_Data!G16","v":"Sugar Valley"},{"$f":"Rep_Data!H16","v":"GA"},{"$f":"Rep_Data!I16","v":"30746"},{"$f":"Rep_Data!J16","v":"Surgery"},{"$f":"IF(Rep_Data!N16 = 0, \"-\",IF(Rep_Data!N16 = \"\",\"-\",Rep_Data!N16))","v":"YES"},{"$f":"IF(Rep_Data!O16 = 0, \"-\",IF(Rep_Data!O16 = \"\",\"-\",Rep_Data!O16))","v":"1 - 2"},{"$f":"IF(Rep_Data!P16 = 0, \"-\",IF(Rep_Data!P16 = \"\",\"-\",Rep_Data!P16))","v":"NONE"},{"$f":"IF(Rep_Data!Q16 = 0, \"-\",IF(Rep_Data!Q16 = \"\",\"-\",Rep_Data!Q16))","v":"2 - 3"},{"$f":"IF(Rep_Data!R16 = 0, \"-\",IF(Rep_Data!R16 = \"\",\"-\",Rep_Data!R16))","v":"More than 2"},null,null,null,null,null,null,null,null,null,null,null,null,null,{"$f":"Table1[[#This Row],[Speciality]]&Table1[[#This Row],[Q1]]","v":"SurgeryYES"}]
[null,15,{"$f":"Rep_Data!A17","v":"ANTONIO,  ROSALYN"},{"$f":"Rep_Data!C17","v":"O53142"},{"$f":"Rep_Data!G17","v":"Aurora"},{"$f":"Rep_Data!H17","v":"CO"},{"$f":"Rep_Data!I17","v":"80014"},{"$f":"Rep_Data!J17","v":"GP"},{"$f":"IF(Rep_Data!N17 = 0, \"-\",IF(Rep_Data!N17 = \"\",\"-\",Rep_Data!N17))","v":"-"},{"$f":"IF(Rep_Data!O17 = 0, \"-\",IF(Rep_Data!O17 = \"\",\"-\",Rep_Data!O17))","v":"-"},{"$f":"IF(Rep_Data!P17 = 0, \"-\",IF(Rep_Data!P17 = \"\",\"-\",Rep_Data!P17))","v":"-"},{"$f":"IF(Rep_Data!Q17 = 0, \"-\",IF(Rep_Data!Q17 = \"\",\"-\",Rep_Data!Q17))","v":"-"},{"$f":"IF(Rep_Data!R17 = 0, \"-\",IF(Rep_Data!R17 = \"\",\"-\",Rep_Data!R17))","v":"-"},null,null,null,null,null,null,null,null,null,null,null,null,null,{"$f":"Table1[[#This Row],[Speciality]]&Table1[[#This Row],[Q1]]","v":"GP-"}]
[null,16,{"$f":"Rep_Data!A18","v":"ASHA,  KUM"},{"$f":"Rep_Data!C18","v":"O79730"},{"$f":"Rep_Data!G18","v":"Norwood"},{"$f":"Rep_Data!H18","v":"MN"},{"$f":"Rep_Data!I18","v":"55383"},{"$f":"Rep_Data!J18","v":"Ortho"},{"$f":"IF(Rep_Data!N18 = 0, \"-\",IF(Rep_Data!N18 = \"\",\"-\",Rep_Data!N18))","v":"-"},{"$f":"IF(Rep_Data!O18 = 0, \"-\",IF(Rep_Data!O18 = \"\",\"-\",Rep_Data!O18))","v":"-"},{"$f":"IF(Rep_Data!P18 = 0, \"-\",IF(Rep_Data!P18 = \"\",\"-\",Rep_Data!P18))","v":"-"},{"$f":"IF(Rep_Data!Q18 = 0, \"-\",IF(Rep_Data!Q18 = \"\",\"-\",Rep_Data!Q18))","v":"-"},{"$f":"IF(Rep_Data!R18 = 0, \"-\",IF(Rep_Data!R18 = \"\",\"-\",Rep_Data!R18))","v":"-"},null,null,null,null,null,null,null,null,null,null,null,null,null,{"$f":"Table1[[#This Row],[Speciality]]&Table1[[#This Row],[Q1]]","v":"Ortho-"}]
[null,17,{"$f":"Rep_Data!A19","v":"AUDIE,  AUGUST"},{"$f":"Rep_Data!C19","v":"O57841"},{"$f":"Rep_Data!G19","v":"Ocate"},{"$f":"Rep_Data!H19","v":"NM"},{"$f":"Rep_Data!I19","v":"87734"},{"$f":"Rep_Data!J19","v":"GP"},{"$f":"IF(Rep_Data!N19 = 0, \"-\",IF(Rep_Data!N19 = \"\",\"-\",Rep_Data!N19))","v":"YES"},{"$f":"IF(Rep_Data!O19 = 0, \"-\",IF(Rep_Data!O19 = \"\",\"-\",Rep_Data!O19))","v":"3 - 4"},{"$f":"IF(Rep_Data!P19 = 0, \"-\",IF(Rep_Data!P19 = \"\",\"-\",Rep_Data!P19))","v":"1 - 3"},{"$f":"IF(Rep_Data!Q19 = 0, \"-\",IF(Rep_Data!Q19 = \"\",\"-\",Rep_Data!Q19))","v":"More than 3"},{"$f":"IF(Rep_Data!R19 = 0, \"-\",IF(Rep_Data!R19 = \"\",\"-\",Rep_Data!R19))","v":"More than 2"},null,null,null,null,null,null,null,null,null,null,null,null,null,{"$f":"Table1[[#This Row],[Speciality]]&Table1[[#This Row],[Q1]]","v":"GPYES"}]
[null,18,{"$f":"Rep_Data!A20","v":"AUGUSTA,  KIMBERLEE"},{"$f":"Rep_Data!C20","v":"O60307"},{"$f":"Rep_Data!G20","v":"Canada"},{"$f":"Rep_Data!H20","v":"KY"},{"$f":"Rep_Data!I20","v":"41519"},{"$f":"Rep_Data!J20","v":"GP"},{"$f":"IF(Rep_Data!N20 = 0, \"-\",IF(Rep_Data!N20 = \"\",\"-\",Rep_Data!N20))","v":"YES"},{"$f":"IF(Rep_Data!O20 = 0, \"-\",IF(Rep_Data!O20 = \"\",\"-\",Rep_Data!O20))","v":"1 - 2"},{"$f":"IF(Rep_Data!P20 = 0, \"-\",IF(Rep_Data!P20 = \"\",\"-\",Rep_Data!P20))","v":"NONE"},{"$f":"IF(Rep_Data!Q20 = 0, \"-\",IF(Rep_Data!Q20 = \"\",\"-\",Rep_Data!Q20))","v":"1"},{"$f":"IF(Rep_Data!R20 = 0, \"-\",IF(Rep_Data!R20 = \"\",\"-\",Rep_Data!R20))","v":"2 or Less"},null,null,null,null,null,null,null,null,null,null,null,null,null,{"$f":"Table1[[#This Row],[Speciality]]&Table1[[#This Row],[Q1]]","v":"GPYES"}]
[null,19,{"$f":"Rep_Data!A21","v":"AURELIO,  ETHAN"},{"$f":"Rep_Data!C21","v":"O69052"},{"$f":"Rep_Data!G21","v":"Chambersville"},{"$f":"Rep_Data!H21","v":"PA"},{"$f":"Rep_Data!I21","v":"15723"},{"$f":"Rep_Data!J21","v":"GP"},{"$f":"IF(Rep_Data!N21 = 0, \"-\",IF(Rep_Data!N21 = \"\",\"-\",Rep_Data!N21))","v":"-"},{"$f":"IF(Rep_Data!O21 = 0, \"-\",IF(Rep_Data!O21 = \"\",\"-\",Rep_Data!O21))","v":"-"},{"$f":"IF(Rep_Data!P21 = 0, \"-\",IF(Rep_Data!P21 = \"\",\"-\",Rep_Data!P21))","v":"-"},{"$f":"IF(Rep_Data!Q21 = 0, \"-\",IF(Rep_Data!Q21 = \"\",\"-\",Rep_Data!Q21))","v":"-"},{"$f":"IF(Rep_Data!R21 = 0, \"-\",IF(Rep_Data!R21 = \"\",\"-\",Rep_Data!R21))","v":"-"},null,null,null,null,null,null,null,null,null,null,null,null,null,{"$f":"Table1[[#This Row],[Speciality]]&Table1[[#This Row],[Q1]]","v":"GP-"}]
[null,20,{"$f":"Rep_Data!A22","v":"AWILDA,  LAWRENCE"},{"$f":"Rep_Data!C22","v":"O74602"},{"$f":"Rep_Data!G22","v":"Chattanooga"},{"$f":"Rep_Data!H22","v":"TN"},{"$f":"Rep_Data!I22","v":"37450"},{"$f":"Rep_Data!J22","v":"Ortho"},{"$f":"IF(Rep_Data!N22 = 0, \"-\",IF(Rep_Data!N22 = \"\",\"-\",Rep_Data!N22))","v":"-"},{"$f":"IF(Rep_Data!O22 = 0, \"-\",IF(Rep_Data!O22 = \"\",\"-\",Rep_Data!O22))","v":"-"},{"$f":"IF(Rep_Data!P22 = 0, \"-\",IF(Rep_Data!P22 = \"\",\"-\",Rep_Data!P22))","v":"-"},{"$f":"IF(Rep_Data!Q22 = 0, \"-\",IF(Rep_Data!Q22 = \"\",\"-\",Rep_Data!Q22))","v":"-"},{"$f":"IF(Rep_Data!R22 = 0, \"-\",IF(Rep_Data!R22 = \"\",\"-\",Rep_Data!R22))","v":"-"},null,null,null,null,null,null,null,null,null,null,null,null,null,{"$f":"Table1[[#This Row],[Speciality]]&Table1[[#This Row],[Q1]]","v":"Ortho-"}]
[null,21,{"$f":"Rep_Data!A23","v":"AZALEE,  HUONG"},{"$f":"Rep_Data!C23","v":"O72714"},{"$f":"Rep_Data!G23","v":"Fresno"},{"$f":"Rep_Data!H23","v":"CA"},{"$f":"Rep_Data!I23","v":"93773"},{"$f":"Rep_Data!J23","v":"Ortho"},{"$f":"IF(Rep_Data!N23 = 0, \"-\",IF(Rep_Data!N23 = \"\",\"-\",Rep_Data!N23))","v":"-"},{"$f":"IF(Rep_Data!O23 = 0, \"-\",IF(Rep_Data!O23 = \"\",\"-\",Rep_Data!O23))","v":"-"},{"$f":"IF(Rep_Data!P23 = 0, \"-\",IF(Rep_Data!P23 = \"\",\"-\",Rep_Data!P23))","v":"-"},{"$f":"IF(Rep_Data!Q23 = 0, \"-\",IF(Rep_Data!Q23 = \"\",\"-\",Rep_Data!Q23))","v":"-"},{"$f":"IF(Rep_Data!R23 = 0, \"-\",IF(Rep_Data!R23 = \"\",\"-\",Rep_Data!R23))","v":"-"},null,null,null,null,null,null,null,null,null,null,null,null,null,{"$f":"Table1[[#This Row],[Speciality]]&Table1[[#This Row],[Q1]]","v":"Ortho-"}]
[null,22,{"$f":"Rep_Data!A24","v":"BAMBI,  LEEANN"},{"$f":"Rep_Data!C24","v":"O68850"},{"$f":"Rep_Data!G24","v":"Fort Harrison"},{"$f":"Rep_Data!H24","v":"MT"},{"$f":"Rep_Data!I24","v":"59636"},{"$f":"Rep_Data!J24","v":"GP"},{"$f":"IF(Rep_Data!N24 = 0, \"-\",IF(Rep_Data!N24 = \"\",\"-\",Rep_Data!N24))","v":"-"},{"$f":"IF(Rep_Data!O24 = 0, \"-\",IF(Rep_Data!O24 = \"\",\"-\",Rep_Data!O24))","v":"-"},{"$f":"IF(Rep_Data!P24 = 0, \"-\",IF(Rep_Data!P24 = \"\",\"-\",Rep_Data!P24))","v":"-"},{"$f":"IF(Rep_Data!Q24 = 0, \"-\",IF(Rep_Data!Q24 = \"\",\"-\",Rep_Data!Q24))","v":"-"},{"$f":"IF(Rep_Data!R24 = 0, \"-\",IF(Rep_Data!R24 = \"\",\"-\",Rep_Data!R24))","v":"-"},null,null,null,null,null,null,null,null,null,null,null,null,null,{"$f":"Table1[[#This Row],[Speciality]]&Table1[[#This Row],[Q1]]","v":"GP-"}]
[null,23,{"$f":"Rep_Data!A25","v":"BARBAR,  EVETTE"},{"$f":"Rep_Data!C25","v":"O50681"},{"$f":"Rep_Data!G25","v":"Roselawn"},{"$f":"Rep_Data!H25","v":"IN"},{"$f":"Rep_Data!I25","v":"46372"},{"$f":"Rep_Data!J25","v":"GP"},{"$f":"IF(Rep_Data!N25 = 0, \"-\",IF(Rep_Data!N25 = \"\",\"-\",Rep_Data!N25))","v":"NO"},{"$f":"IF(Rep_Data!O25 = 0, \"-\",IF(Rep_Data!O25 = \"\",\"-\",Rep_Data!O25))","v":"1 - 2"},{"$f":"IF(Rep_Data!P25 = 0, \"-\",IF(Rep_Data!P25 = \"\",\"-\",Rep_Data!P25))","v":"NONE"},{"$f":"IF(Rep_Data!Q25 = 0, \"-\",IF(Rep_Data!Q25 = \"\",\"-\",Rep_Data!Q25))","v":"2 - 3"},{"$f":"IF(Rep_Data!R25 = 0, \"-\",IF(Rep_Data!R25 = \"\",\"-\",Rep_Data!R25))","v":"2 or Less"},null,null,null,null,null,null,null,null,null,null,null,null,null,{"$f":"Table1[[#This Row],[Speciality]]&Table1[[#This Row],[Q1]]","v":"GPNO"}]
[null,24,{"$f":"Rep_Data!A26","v":"BECKIE,  MARLINE"},{"$f":"Rep_Data!C26","v":"O63823"},{"$f":"Rep_Data!G26","v":"Providence"},{"$f":"Rep_Data!H26","v":"RI"},{"$f":"Rep_Data!I26","v":"02906"},{"$f":"Rep_Data!J26","v":"GP"},{"$f":"IF(Rep_Data!N26 = 0, \"-\",IF(Rep_Data!N26 = \"\",\"-\",Rep_Data!N26))","v":"-"},{"$f":"IF(Rep_Data!O26 = 0, \"-\",IF(Rep_Data!O26 = \"\",\"-\",Rep_Data!O26))","v":"-"},{"$f":"IF(Rep_Data!P26 = 0, \"-\",IF(Rep_Data!P26 = \"\",\"-\",Rep_Data!P26))","v":"-"},{"$f":"IF(Rep_Data!Q26 = 0, \"-\",IF(Rep_Data!Q26 = \"\",\"-\",Rep_Data!Q26))","v":"-"},{"$f":"IF(Rep_Data!R26 = 0, \"-\",IF(Rep_Data!R26 = \"\",\"-\",Rep_Data!R26))","v":"-"},null,null,null,null,null,null,null,null,null,null,null,null,null,{"$f":"Table1[[#This Row],[Speciality]]&Table1[[#This Row],[Q1]]","v":"GP-"}]
[null,25,{"$f":"Rep_Data!A27","v":"BELIA,  JAMI"},{"$f":"Rep_Data!C27","v":"O62845"},{"$f":"Rep_Data!G27","v":"Bruno"},{"$f":"Rep_Data!H27","v":"MN"},{"$f":"Rep_Data!I27","v":"55712"},{"$f":"Rep_Data!J27","v":"GP"},{"$f":"IF(Rep_Data!N27 = 0, \"-\",IF(Rep_Data!N27 = \"\",\"-\",Rep_Data!N27))","v":"YES"},{"$f":"IF(Rep_Data!O27 = 0, \"-\",IF(Rep_Data!O27 = \"\",\"-\",Rep_Data!O27))","v":"3 - 4"},{"$f":"IF(Rep_Data!P27 = 0, \"-\",IF(Rep_Data!P27 = \"\",\"-\",Rep_Data!P27))","v":"1 - 3"},{"$f":"IF(Rep_Data!Q27 = 0, \"-\",IF(Rep_Data!Q27 = \"\",\"-\",Rep_Data!Q27))","v":"More than 3"},{"$f":"IF(Rep_Data!R27 = 0, \"-\",IF(Rep_Data!R27 = \"\",\"-\",Rep_Data!R27))","v":"More than 2"},null,null,null,null,null,null,null,null,null,null,null,null,null,{"$f":"Table1[[#This Row],[Speciality]]&Table1[[#This Row],[Q1]]","v":"GPYES"}]
[null,26,{"$f":"Rep_Data!A28","v":"BENITA,  JACKELYN"},{"$f":"Rep_Data!C28","v":"O57426"},{"$f":"Rep_Data!G28","v":"Charlottesville"},{"$f":"Rep_Data!H28","v":"IN"},{"$f":"Rep_Data!I28","v":"46117"},{"$f":"Rep_Data!J28","v":"GP"},{"$f":"IF(Rep_Data!N28 = 0, \"-\",IF(Rep_Data!N28 = \"\",\"-\",Rep_Data!N28))","v":"YES"},{"$f":"IF(Rep_Data!O28 = 0, \"-\",IF(Rep_Data!O28 = \"\",\"-\",Rep_Data!O28))","v":"1 - 2"},{"$f":"IF(Rep_Data!P28 = 0, \"-\",IF(Rep_Data!P28 = \"\",\"-\",Rep_Data!P28))","v":"NONE"},{"$f":"IF(Rep_Data!Q28 = 0, \"-\",IF(Rep_Data!Q28 = \"\",\"-\",Rep_Data!Q28))","v":"1"},{"$f":"IF(Rep_Data!R28 = 0, \"-\",IF(Rep_Data!R28 = \"\",\"-\",Rep_Data!R28))","v":"2 or Less"},null,null,null,null,null,null,null,null,null,null,null,null,null,{"$f":"Table1[[#This Row],[Speciality]]&Table1[[#This Row],[Q1]]","v":"GPYES"}]
[null,27,{"$f":"Rep_Data!A29","v":"BENTON,  DORA"},{"$f":"Rep_Data!C29","v":"O69673"},{"$f":"Rep_Data!G29","v":"Lamona"},{"$f":"Rep_Data!H29","v":"WA"},{"$f":"Rep_Data!I29","v":"99144"},{"$f":"Rep_Data!J29","v":"GP"},{"$f":"IF(Rep_Data!N29 = 0, \"-\",IF(Rep_Data!N29 = \"\",\"-\",Rep_Data!N29))","v":"-"},{"$f":"IF(Rep_Data!O29 = 0, \"-\",IF(Rep_Data!O29 = \"\",\"-\",Rep_Data!O29))","v":"-"},{"$f":"IF(Rep_Data!P29 = 0, \"-\",IF(Rep_Data!P29 = \"\",\"-\",Rep_Data!P29))","v":"-"},{"$f":"IF(Rep_Data!Q29 = 0, \"-\",IF(Rep_Data!Q29 = \"\",\"-\",Rep_Data!Q29))","v":"-"},{"$f":"IF(Rep_Data!R29 = 0, \"-\",IF(Rep_Data!R29 = \"\",\"-\",Rep_Data!R29))","v":"-"},null,null,null,null,null,null,null,null,null,null,null,null,null,{"$f":"Table1[[#This Row],[Speciality]]&Table1[[#This Row],[Q1]]","v":"GP-"}]
[null,28,{"$f":"Rep_Data!A30","v":"BILLIE,  BURL"},{"$f":"Rep_Data!C30","v":"O51409"},{"$f":"Rep_Data!G30","v":"Saint Augustine"},{"$f":"Rep_Data!H30","v":"FL"},{"$f":"Rep_Data!I30","v":"32092"},{"$f":"Rep_Data!J30","v":"GP"},{"$f":"IF(Rep_Data!N30 = 0, \"-\",IF(Rep_Data!N30 = \"\",\"-\",Rep_Data!N30))","v":"-"},{"$f":"IF(Rep_Data!O30 = 0, \"-\",IF(Rep_Data!O30 = \"\",\"-\",Rep_Data!O30))","v":"-"},{"$f":"IF(Rep_Data!P30 = 0, \"-\",IF(Rep_Data!P30 = \"\",\"-\",Rep_Data!P30))","v":"-"},{"$f":"IF(Rep_Data!Q30 = 0, \"-\",IF(Rep_Data!Q30 = \"\",\"-\",Rep_Data!Q30))","v":"-"},{"$f":"IF(Rep_Data!R30 = 0, \"-\",IF(Rep_Data!R30 = \"\",\"-\",Rep_Data!R30))","v":"-"},null,null,null,null,null,null,null,null,null,null,null,null,null,{"$f":"Table1[[#This Row],[Speciality]]&Table1[[#This Row],[Q1]]","v":"GP-"}]
[null,29,{"$f":"Rep_Data!A31","v":"BLANCA,  WILDA"},{"$f":"Rep_Data!C31","v":"O72299"},{"$f":"Rep_Data!G31","v":"Washougal"},{"$f":"Rep_Data!H31","v":"WA"},{"$f":"Rep_Data!I31","v":"98671"},{"$f":"Rep_Data!J31","v":"GP"},{"$f":"IF(Rep_Data!N31 = 0, \"-\",IF(Rep_Data!N31 = \"\",\"-\",Rep_Data!N31))","v":"YES"},{"$f":"IF(Rep_Data!O31 = 0, \"-\",IF(Rep_Data!O31 = \"\",\"-\",Rep_Data!O31))","v":"3 - 4"},{"$f":"IF(Rep_Data!P31 = 0, \"-\",IF(Rep_Data!P31 = \"\",\"-\",Rep_Data!P31))","v":"1 - 3"},{"$f":"IF(Rep_Data!Q31 = 0, \"-\",IF(Rep_Data!Q31 = \"\",\"-\",Rep_Data!Q31))","v":"1"},{"$f":"IF(Rep_Data!R31 = 0, \"-\",IF(Rep_Data!R31 = \"\",\"-\",Rep_Data!R31))","v":"More than 2"},null,null,null,null,null,null,null,null,null,null,null,null,null,{"$f":"Table1[[#This Row],[Speciality]]&Table1[[#This Row],[Q1]]","v":"GPYES"}]
[null,30,{"$f":"Rep_Data!A32","v":"BRADY,  DORRIS"},{"$f":"Rep_Data!C32","v":"O56575"},{"$f":"Rep_Data!G32","v":"Simi Valley"},{"$f":"Rep_Data!H32","v":"CA"},{"$f":"Rep_Data!I32","v":"93065"},{"$f":"Rep_Data!J32","v":"GP"},{"$f":"IF(Rep_Data!N32 = 0, \"-\",IF(Rep_Data!N32 = \"\",\"-\",Rep_Data!N32))","v":"YES"},{"$f":"IF(Rep_Data!O32 = 0, \"-\",IF(Rep_Data!O32 = \"\",\"-\",Rep_Data!O32))","v":"3 - 4"},{"$f":"IF(Rep_Data!P32 = 0, \"-\",IF(Rep_Data!P32 = \"\",\"-\",Rep_Data!P32))","v":"1 - 3"},{"$f":"IF(Rep_Data!Q32 = 0, \"-\",IF(Rep_Data!Q32 = \"\",\"-\",Rep_Data!Q32))","v":"1"},{"$f":"IF(Rep_Data!R32 = 0, \"-\",IF(Rep_Data!R32 = \"\",\"-\",Rep_Data!R32))","v":"More than 2"},null,null,null,null,null,null,null,null,null,null,null,null,null,{"$f":"Table1[[#This Row],[Speciality]]&Table1[[#This Row],[Q1]]","v":"GPYES"}]
[null,31,{"$f":"Rep_Data!A33","v":"BRANDON,  LOUISE"},{"$f":"Rep_Data!C33","v":"O59760"},{"$f":"Rep_Data!G33","v":"Baldwinsville"},{"$f":"Rep_Data!H33","v":"NY"},{"$f":"Rep_Data!I33","v":"13027"},{"$f":"Rep_Data!J33","v":"Surgery"},{"$f":"IF(Rep_Data!N33 = 0, \"-\",IF(Rep_Data!N33 = \"\",\"-\",Rep_Data!N33))","v":"-"},{"$f":"IF(Rep_Data!O33 = 0, \"-\",IF(Rep_Data!O33 = \"\",\"-\",Rep_Data!O33))","v":"-"},{"$f":"IF(Rep_Data!P33 = 0, \"-\",IF(Rep_Data!P33 = \"\",\"-\",Rep_Data!P33))","v":"-"},{"$f":"IF(Rep_Data!Q33 = 0, \"-\",IF(Rep_Data!Q33 = \"\",\"-\",Rep_Data!Q33))","v":"-"},{"$f":"IF(Rep_Data!R33 = 0, \"-\",IF(Rep_Data!R33 = \"\",\"-\",Rep_Data!R33))","v":"-"},null,null,null,null,null,null,null,null,null,null,null,null,null,{"$f":"Table1[[#This Row],[Speciality]]&Table1[[#This Row],[Q1]]","v":"Surgery-"}]
[null,32,{"$f":"Rep_Data!A34","v":"BREANA,  KYLEE"},{"$f":"Rep_Data!C34","v":"O51694"},{"$f":"Rep_Data!G34","v":"Plush"},{"$f":"Rep_Data!H34","v":"OR"},{"$f":"Rep_Data!I34","v":"97637"},{"$f":"Rep_Data!J34","v":"Ortho"},{"$f":"IF(Rep_Data!N34 = 0, \"-\",IF(Rep_Data!N34 = \"\",\"-\",Rep_Data!N34))","v":"-"},{"$f":"IF(Rep_Data!O34 = 0, \"-\",IF(Rep_Data!O34 = \"\",\"-\",Rep_Data!O34))","v":"-"},{"$f":"IF(Rep_Data!P34 = 0, \"-\",IF(Rep_Data!P34 = \"\",\"-\",Rep_Data!P34))","v":"-"},{"$f":"IF(Rep_Data!Q34 = 0, \"-\",IF(Rep_Data!Q34 = \"\",\"-\",Rep_Data!Q34))","v":"-"},{"$f":"IF(Rep_Data!R34 = 0, \"-\",IF(Rep_Data!R34 = \"\",\"-\",Rep_Data!R34))","v":"-"},null,null,null,null,null,null,null,null,null,null,null,null,null,{"$f":"Table1[[#This Row],[Speciality]]&Table1[[#This Row],[Q1]]","v":"Ortho-"}]
[null,33,{"$f":"Rep_Data!A35","v":"BRIANNA,  SHELLEY"},{"$f":"Rep_Data!C35","v":"O65594"},{"$f":"Rep_Data!G35","v":"Centerfield"},{"$f":"Rep_Data!H35","v":"UT"},{"$f":"Rep_Data!I35","v":"84622"},{"$f":"Rep_Data!J35","v":"GP"},{"$f":"IF(Rep_Data!N35 = 0, \"-\",IF(Rep_Data!N35 = \"\",\"-\",Rep_Data!N35))","v":"-"},{"$f":"IF(Rep_Data!O35 = 0, \"-\",IF(Rep_Data!O35 = \"\",\"-\",Rep_Data!O35))","v":"-"},{"$f":"IF(Rep_Data!P35 = 0, \"-\",IF(Rep_Data!P35 = \"\",\"-\",Rep_Data!P35))","v":"-"},{"$f":"IF(Rep_Data!Q35 = 0, \"-\",IF(Rep_Data!Q35 = \"\",\"-\",Rep_Data!Q35))","v":"-"},{"$f":"IF(Rep_Data!R35 = 0, \"-\",IF(Rep_Data!R35 = \"\",\"-\",Rep_Data!R35))","v":"-"},null,null,null,null,null,null,null,null,null,null,null,null,null,{"$f":"Table1[[#This Row],[Speciality]]&Table1[[#This Row],[Q1]]","v":"GP-"}]
[null,34,{"$f":"Rep_Data!A36","v":"BROOKS,  ALISA"},{"$f":"Rep_Data!C36","v":"O74690"},{"$f":"Rep_Data!G36","v":"Sacramento"},{"$f":"Rep_Data!H36","v":"CA"},{"$f":"Rep_Data!I36","v":"94235"},{"$f":"Rep_Data!J36","v":"GP"},{"$f":"IF(Rep_Data!N36 = 0, \"-\",IF(Rep_Data!N36 = \"\",\"-\",Rep_Data!N36))","v":"-"},{"$f":"IF(Rep_Data!O36 = 0, \"-\",IF(Rep_Data!O36 = \"\",\"-\",Rep_Data!O36))","v":"-"},{"$f":"IF(Rep_Data!P36 = 0, \"-\",IF(Rep_Data!P36 = \"\",\"-\",Rep_Data!P36))","v":"-"},{"$f":"IF(Rep_Data!Q36 = 0, \"-\",IF(Rep_Data!Q36 = \"\",\"-\",Rep_Data!Q36))","v":"-"},{"$f":"IF(Rep_Data!R36 = 0, \"-\",IF(Rep_Data!R36 = \"\",\"-\",Rep_Data!R36))","v":"-"},null,null,null,null,null,null,null,null,null,null,null,null,null,{"$f":"Table1[[#This Row],[Speciality]]&Table1[[#This Row],[Q1]]","v":"GP-"}]
[null,35,{"$f":"Rep_Data!A37","v":"BURMA,  BRYANNA"},{"$f":"Rep_Data!C37","v":"O73883"},{"$f":"Rep_Data!G37","v":"Broughton"},{"$f":"Rep_Data!H37","v":"IL"},{"$f":"Rep_Data!I37","v":"62817"},{"$f":"Rep_Data!J37","v":"Surgery"},{"$f":"IF(Rep_Data!N37 = 0, \"-\",IF(Rep_Data!N37 = \"\",\"-\",Rep_Data!N37))","v":"-"},{"$f":"IF(Rep_Data!O37 = 0, \"-\",IF(Rep_Data!O37 = \"\",\"-\",Rep_Data!O37))","v":"-"},{"$f":"IF(Rep_Data!P37 = 0, \"-\",IF(Rep_Data!P37 = \"\",\"-\",Rep_Data!P37))","v":"-"},{"$f":"IF(Rep_Data!Q37 = 0, \"-\",IF(Rep_Data!Q37 = \"\",\"-\",Rep_Data!Q37))","v":"-"},{"$f":"IF(Rep_Data!R37 = 0, \"-\",IF(Rep_Data!R37 = \"\",\"-\",Rep_Data!R37))","v":"-"},null,null,null,null,null,null,null,null,null,null,null,null,null,{"$f":"Table1[[#This Row],[Speciality]]&Table1[[#This Row],[Q1]]","v":"Surgery-"}]
[null,36,{"$f":"Rep_Data!A38","v":"BURTON,  LINDY"},{"$f":"Rep_Data!C38","v":"O55797"},{"$f":"Rep_Data!G38","v":"Gypsum"},{"$f":"Rep_Data!H38","v":"CO"},{"$f":"Rep_Data!I38","v":"81637"},{"$f":"Rep_Data!J38","v":"Ortho"},{"$f":"IF(Rep_Data!N38 = 0, \"-\",IF(Rep_Data!N38 = \"\",\"-\",Rep_Data!N38))","v":"-"},{"$f":"IF(Rep_Data!O38 = 0, \"-\",IF(Rep_Data!O38 = \"\",\"-\",Rep_Data!O38))","v":"-"},{"$f":"IF(Rep_Data!P38 = 0, \"-\",IF(Rep_Data!P38 = \"\",\"-\",Rep_Data!P38))","v":"-"},{"$f":"IF(Rep_Data!Q38 = 0, \"-\",IF(Rep_Data!Q38 = \"\",\"-\",Rep_Data!Q38))","v":"-"},{"$f":"IF(Rep_Data!R38 = 0, \"-\",IF(Rep_Data!R38 = \"\",\"-\",Rep_Data!R38))","v":"-"},null,null,null,null,null,null,null,null,null,null,null,null,null,{"$f":"Table1[[#This Row],[Speciality]]&Table1[[#This Row],[Q1]]","v":"Ortho-"}]
[null,37,{"$f":"Rep_Data!A39","v":"CARMELLA,  LYNN"},{"$f":"Rep_Data!C39","v":"O51891"},{"$f":"Rep_Data!G39","v":"Bicknell"},{"$f":"Rep_Data!H39","v":"IN"},{"$f":"Rep_Data!I39","v":"47512"},{"$f":"Rep_Data!J39","v":"Ortho"},{"$f":"IF(Rep_Data!N39 = 0, \"-\",IF(Rep_Data!N39 = \"\",\"-\",Rep_Data!N39))","v":"YES"},{"$f":"IF(Rep_Data!O39 = 0, \"-\",IF(Rep_Data!O39 = \"\",\"-\",Rep_Data!O39))","v":"3 - 4"},{"$f":"IF(Rep_Data!P39 = 0, \"-\",IF(Rep_Data!P39 = \"\",\"-\",Rep_Data!P39))","v":"1 - 3"},{"$f":"IF(Rep_Data!Q39 = 0, \"-\",IF(Rep_Data!Q39 = \"\",\"-\",Rep_Data!Q39))","v":"1"},{"$f":"IF(Rep_Data!R39 = 0, \"-\",IF(Rep_Data!R39 = \"\",\"-\",Rep_Data!R39))","v":"More than 2"},null,null,null,null,null,null,null,null,null,null,null,null,null,{"$f":"Table1[[#This Row],[Speciality]]&Table1[[#This Row],[Q1]]","v":"OrthoYES"}]
[null,38,{"$f":"Rep_Data!A40","v":"CECIL,  MARLEN"},{"$f":"Rep_Data!C40","v":"O54818"},{"$f":"Rep_Data!G40","v":"Torrance"},{"$f":"Rep_Data!H40","v":"CA"},{"$f":"Rep_Data!I40","v":"90509"},{"$f":"Rep_Data!J40","v":"GP"},{"$f":"IF(Rep_Data!N40 = 0, \"-\",IF(Rep_Data!N40 = \"\",\"-\",Rep_Data!N40))","v":"-"},{"$f":"IF(Rep_Data!O40 = 0, \"-\",IF(Rep_Data!O40 = \"\",\"-\",Rep_Data!O40))","v":"-"},{"$f":"IF(Rep_Data!P40 = 0, \"-\",IF(Rep_Data!P40 = \"\",\"-\",Rep_Data!P40))","v":"-"},{"$f":"IF(Rep_Data!Q40 = 0, \"-\",IF(Rep_Data!Q40 = \"\",\"-\",Rep_Data!Q40))","v":"-"},{"$f":"IF(Rep_Data!R40 = 0, \"-\",IF(Rep_Data!R40 = \"\",\"-\",Rep_Data!R40))","v":"-"},null,null,null,null,null,null,null,null,null,null,null,null,null,{"$f":"Table1[[#This Row],[Speciality]]&Table1[[#This Row],[Q1]]","v":"GP-"}]
[null,39,{"$f":"Rep_Data!A41","v":"CECIL,  TAMEIKA"},{"$f":"Rep_Data!C41","v":"O62473"},{"$f":"Rep_Data!G41","v":"Basom"},{"$f":"Rep_Data!H41","v":"NY"},{"$f":"Rep_Data!I41","v":"14013"},{"$f":"Rep_Data!J41","v":"Ortho"},{"$f":"IF(Rep_Data!N41 = 0, \"-\",IF(Rep_Data!N41 = \"\",\"-\",Rep_Data!N41))","v":"-"},{"$f":"IF(Rep_Data!O41 = 0, \"-\",IF(Rep_Data!O41 = \"\",\"-\",Rep_Data!O41))","v":"-"},{"$f":"IF(Rep_Data!P41 = 0, \"-\",IF(Rep_Data!P41 = \"\",\"-\",Rep_Data!P41))","v":"-"},{"$f":"IF(Rep_Data!Q41 = 0, \"-\",IF(Rep_Data!Q41 = \"\",\"-\",Rep_Data!Q41))","v":"-"},{"$f":"IF(Rep_Data!R41 = 0, \"-\",IF(Rep_Data!R41 = \"\",\"-\",Rep_Data!R41))","v":"-"},null,null,null,null,null,null,null,null,null,null,null,null,null,{"$f":"Table1[[#This Row],[Speciality]]&Table1[[#This Row],[Q1]]","v":"Ortho-"}]
[null,40,{"$f":"Rep_Data!A42","v":"CELESTA,  HYON"},{"$f":"Rep_Data!C42","v":"O67977"},{"$f":"Rep_Data!G42","v":"Condon"},{"$f":"Rep_Data!H42","v":"MT"},{"$f":"Rep_Data!I42","v":"59826"},{"$f":"Rep_Data!J42","v":"GP"},{"$f":"IF(Rep_Data!N42 = 0, \"-\",IF(Rep_Data!N42 = \"\",\"-\",Rep_Data!N42))","v":"-"},{"$f":"IF(Rep_Data!O42 = 0, \"-\",IF(Rep_Data!O42 = \"\",\"-\",Rep_Data!O42))","v":"-"},{"$f":"IF(Rep_Data!P42 = 0, \"-\",IF(Rep_Data!P42 = \"\",\"-\",Rep_Data!P42))","v":"-"},{"$f":"IF(Rep_Data!Q42 = 0, \"-\",IF(Rep_Data!Q42 = \"\",\"-\",Rep_Data!Q42))","v":"-"},{"$f":"IF(Rep_Data!R42 = 0, \"-\",IF(Rep_Data!R42 = \"\",\"-\",Rep_Data!R42))","v":"-"},null,null,null,null,null,null,null,null,null,null,null,null,null,{"$f":"Table1[[#This Row],[Speciality]]&Table1[[#This Row],[Q1]]","v":"GP-"}]
[null,41,{"$f":"Rep_Data!A43","v":"CELIA,  SHERRIL"},{"$f":"Rep_Data!C43","v":"O65880"},{"$f":"Rep_Data!G43","v":"Fullerton"},{"$f":"Rep_Data!H43","v":"CA"},{"$f":"Rep_Data!I43","v":"92831"},{"$f":"Rep_Data!J43","v":"Ortho"},{"$f":"IF(Rep_Data!N43 = 0, \"-\",IF(Rep_Data!N43 = \"\",\"-\",Rep_Data!N43))","v":"-"},{"$f":"IF(Rep_Data!O43 = 0, \"-\",IF(Rep_Data!O43 = \"\",\"-\",Rep_Data!O43))","v":"-"},{"$f":"IF(Rep_Data!P43 = 0, \"-\",IF(Rep_Data!P43 = \"\",\"-\",Rep_Data!P43))","v":"-"},{"$f":"IF(Rep_Data!Q43 = 0, \"-\",IF(Rep_Data!Q43 = \"\",\"-\",Rep_Data!Q43))","v":"-"},{"$f":"IF(Rep_Data!R43 = 0, \"-\",IF(Rep_Data!R43 = \"\",\"-\",Rep_Data!R43))","v":"-"},null,null,null,null,null,null,null,null,null,null,null,null,null,{"$f":"Table1[[#This Row],[Speciality]]&Table1[[#This Row],[Q1]]","v":"Ortho-"}]
[null,42,{"$f":"Rep_Data!A44","v":"CHANTELLE,  AGUSTINA"},{"$f":"Rep_Data!C44","v":"O58712"},{"$f":"Rep_Data!G44","v":"Rowesville"},{"$f":"Rep_Data!H44","v":"SC"},{"$f":"Rep_Data!I44","v":"29133"},{"$f":"Rep_Data!J44","v":"GP"},{"$f":"IF(Rep_Data!N44 = 0, \"-\",IF(Rep_Data!N44 = \"\",\"-\",Rep_Data!N44))","v":"-"},{"$f":"IF(Rep_Data!O44 = 0, \"-\",IF(Rep_Data!O44 = \"\",\"-\",Rep_Data!O44))","v":"-"},{"$f":"IF(Rep_Data!P44 = 0, \"-\",IF(Rep_Data!P44 = \"\",\"-\",Rep_Data!P44))","v":"-"},{"$f":"IF(Rep_Data!Q44 = 0, \"-\",IF(Rep_Data!Q44 = \"\",\"-\",Rep_Data!Q44))","v":"-"},{"$f":"IF(Rep_Data!R44 = 0, \"-\",IF(Rep_Data!R44 = \"\",\"-\",Rep_Data!R44))","v":"-"},null,null,null,null,null,null,null,null,null,null,null,null,null,{"$f":"Table1[[#This Row],[Speciality]]&Table1[[#This Row],[Q1]]","v":"GP-"}]
[null,43,{"$f":"Rep_Data!A45","v":"CHARLINE,  LUANA"},{"$f":"Rep_Data!C45","v":"O69207"},{"$f":"Rep_Data!G45","v":"Miami"},{"$f":"Rep_Data!H45","v":"FL"},{"$f":"Rep_Data!I45","v":"33199"},{"$f":"Rep_Data!J45","v":"Ortho"},{"$f":"IF(Rep_Data!N45 = 0, \"-\",IF(Rep_Data!N45 = \"\",\"-\",Rep_Data!N45))","v":"YES"},{"$f":"IF(Rep_Data!O45 = 0, \"-\",IF(Rep_Data!O45 = \"\",\"-\",Rep_Data!O45))","v":"1 - 2"},{"$f":"IF(Rep_Data!P45 = 0, \"-\",IF(Rep_Data!P45 = \"\",\"-\",Rep_Data!P45))","v":"NONE"},{"$f":"IF(Rep_Data!Q45 = 0, \"-\",IF(Rep_Data!Q45 = \"\",\"-\",Rep_Data!Q45))","v":"1"},{"$f":"IF(Rep_Data!R45 = 0, \"-\",IF(Rep_Data!R45 = \"\",\"-\",Rep_Data!R45))","v":"2 or Less"},null,null,null,null,null,null,null,null,null,null,null,null,null,{"$f":"Table1[[#This Row],[Speciality]]&Table1[[#This Row],[Q1]]","v":"OrthoYES"}]
[null,44,{"$f":"Rep_Data!A46","v":"CHARLOTTE,  RANDA"},{"$f":"Rep_Data!C46","v":"O60783"},{"$f":"Rep_Data!G46","v":"Davin"},{"$f":"Rep_Data!H46","v":"WV"},{"$f":"Rep_Data!I46","v":"25617"},{"$f":"Rep_Data!J46","v":"Surgery"},{"$f":"IF(Rep_Data!N46 = 0, \"-\",IF(Rep_Data!N46 = \"\",\"-\",Rep_Data!N46))","v":"-"},{"$f":"IF(Rep_Data!O46 = 0, \"-\",IF(Rep_Data!O46 = \"\",\"-\",Rep_Data!O46))","v":"-"},{"$f":"IF(Rep_Data!P46 = 0, \"-\",IF(Rep_Data!P46 = \"\",\"-\",Rep_Data!P46))","v":"-"},{"$f":"IF(Rep_Data!Q46 = 0, \"-\",IF(Rep_Data!Q46 = \"\",\"-\",Rep_Data!Q46))","v":"-"},{"$f":"IF(Rep_Data!R46 = 0, \"-\",IF(Rep_Data!R46 = \"\",\"-\",Rep_Data!R46))","v":"-"},null,null,null,null,null,null,null,null,null,null,null,null,null,{"$f":"Table1[[#This Row],[Speciality]]&Table1[[#This Row],[Q1]]","v":"Surgery-"}]
[null,45,{"$f":"Rep_Data!A47","v":"CHERYLL,  CARLENE"},{"$f":"Rep_Data!C47","v":"O54845"},{"$f":"Rep_Data!G47","v":"Williamstown"},{"$f":"Rep_Data!H47","v":"NJ"},{"$f":"Rep_Data!I47","v":"08094"},{"$f":"Rep_Data!J47","v":"GP"},{"$f":"IF(Rep_Data!N47 = 0, \"-\",IF(Rep_Data!N47 = \"\",\"-\",Rep_Data!N47))","v":"-"},{"$f":"IF(Rep_Data!O47 = 0, \"-\",IF(Rep_Data!O47 = \"\",\"-\",Rep_Data!O47))","v":"-"},{"$f":"IF(Rep_Data!P47 = 0, \"-\",IF(Rep_Data!P47 = \"\",\"-\",Rep_Data!P47))","v":"-"},{"$f":"IF(Rep_Data!Q47 = 0, \"-\",IF(Rep_Data!Q47 = \"\",\"-\",Rep_Data!Q47))","v":"-"},{"$f":"IF(Rep_Data!R47 = 0, \"-\",IF(Rep_Data!R47 = \"\",\"-\",Rep_Data!R47))","v":"-"},null,null,null,null,null,null,null,null,null,null,null,null,null,{"$f":"Table1[[#This Row],[Speciality]]&Table1[[#This Row],[Q1]]","v":"GP-"}]
[null,46,{"$f":"Rep_Data!A48","v":"CHRISTINE,  DORTHEY"},{"$f":"Rep_Data!C48","v":"O56142"},{"$f":"Rep_Data!G48","v":"Sacramento"},{"$f":"Rep_Data!H48","v":"CA"},{"$f":"Rep_Data!I48","v":"95857"},{"$f":"Rep_Data!J48","v":"GP"},{"$f":"IF(Rep_Data!N48 = 0, \"-\",IF(Rep_Data!N48 = \"\",\"-\",Rep_Data!N48))","v":"-"},{"$f":"IF(Rep_Data!O48 = 0, \"-\",IF(Rep_Data!O48 = \"\",\"-\",Rep_Data!O48))","v":"-"},{"$f":"IF(Rep_Data!P48 = 0, \"-\",IF(Rep_Data!P48 = \"\",\"-\",Rep_Data!P48))","v":"-"},{"$f":"IF(Rep_Data!Q48 = 0, \"-\",IF(Rep_Data!Q48 = \"\",\"-\",Rep_Data!Q48))","v":"-"},{"$f":"IF(Rep_Data!R48 = 0, \"-\",IF(Rep_Data!R48 = \"\",\"-\",Rep_Data!R48))","v":"-"},null,null,null,null,null,null,null,null,null,null,null,null,null,{"$f":"Table1[[#This Row],[Speciality]]&Table1[[#This Row],[Q1]]","v":"GP-"}]
[null,47,{"$f":"Rep_Data!A49","v":"CLARIBEL,  SPENCER"},{"$f":"Rep_Data!C49","v":"O58483"},{"$f":"Rep_Data!G49","v":"Murdock"},{"$f":"Rep_Data!H49","v":"KS"},{"$f":"Rep_Data!I49","v":"67111"},{"$f":"Rep_Data!J49","v":"Surgery"},{"$f":"IF(Rep_Data!N49 = 0, \"-\",IF(Rep_Data!N49 = \"\",\"-\",Rep_Data!N49))","v":"-"},{"$f":"IF(Rep_Data!O49 = 0, \"-\",IF(Rep_Data!O49 = \"\",\"-\",Rep_Data!O49))","v":"-"},{"$f":"IF(Rep_Data!P49 = 0, \"-\",IF(Rep_Data!P49 = \"\",\"-\",Rep_Data!P49))","v":"-"},{"$f":"IF(Rep_Data!Q49 = 0, \"-\",IF(Rep_Data!Q49 = \"\",\"-\",Rep_Data!Q49))","v":"-"},{"$f":"IF(Rep_Data!R49 = 0, \"-\",IF(Rep_Data!R49 = \"\",\"-\",Rep_Data!R49))","v":"-"},null,null,null,null,null,null,null,null,null,null,null,null,null,{"$f":"Table1[[#This Row],[Speciality]]&Table1[[#This Row],[Q1]]","v":"Surgery-"}]
[null,48,{"$f":"Rep_Data!A50","v":"CLAUDE,  ROSIE"},{"$f":"Rep_Data!C50","v":"O66597"},{"$f":"Rep_Data!G50","v":"Flossmoor"},{"$f":"Rep_Data!H50","v":"IL"},{"$f":"Rep_Data!I50","v":"60422"},{"$f":"Rep_Data!J50","v":"Surgery"},{"$f":"IF(Rep_Data!N50 = 0, \"-\",IF(Rep_Data!N50 = \"\",\"-\",Rep_Data!N50))","v":"-"},{"$f":"IF(Rep_Data!O50 = 0, \"-\",IF(Rep_Data!O50 = \"\",\"-\",Rep_Data!O50))","v":"-"},{"$f":"IF(Rep_Data!P50 = 0, \"-\",IF(Rep_Data!P50 = \"\",\"-\",Rep_Data!P50))","v":"-"},{"$f":"IF(Rep_Data!Q50 = 0, \"-\",IF(Rep_Data!Q50 = \"\",\"-\",Rep_Data!Q50))","v":"-"},{"$f":"IF(Rep_Data!R50 = 0, \"-\",IF(Rep_Data!R50 = \"\",\"-\",Rep_Data!R50))","v":"-"},null,null,null,null,null,null,null,null,null,null,null,null,null,{"$f":"Table1[[#This Row],[Speciality]]&Table1[[#This Row],[Q1]]","v":"Surgery-"}]
[null,49,{"$f":"Rep_Data!A51","v":"CLAY,  TRUMAN"},{"$f":"Rep_Data!C51","v":"O54279"},{"$f":"Rep_Data!G51","v":"King Ferry"},{"$f":"Rep_Data!H51","v":"NY"},{"$f":"Rep_Data!I51","v":"13081"},{"$f":"Rep_Data!J51","v":"GP"},{"$f":"IF(Rep_Data!N51 = 0, \"-\",IF(Rep_Data!N51 = \"\",\"-\",Rep_Data!N51))","v":"-"},{"$f":"IF(Rep_Data!O51 = 0, \"-\",IF(Rep_Data!O51 = \"\",\"-\",Rep_Data!O51))","v":"-"},{"$f":"IF(Rep_Data!P51 = 0, \"-\",IF(Rep_Data!P51 = \"\",\"-\",Rep_Data!P51))","v":"-"},{"$f":"IF(Rep_Data!Q51 = 0, \"-\",IF(Rep_Data!Q51 = \"\",\"-\",Rep_Data!Q51))","v":"-"},{"$f":"IF(Rep_Data!R51 = 0, \"-\",IF(Rep_Data!R51 = \"\",\"-\",Rep_Data!R51))","v":"-"},null,null,null,null,null,null,null,null,null,null,null,null,null,{"$f":"Table1[[#This Row],[Speciality]]&Table1[[#This Row],[Q1]]","v":"GP-"}]
[null,50,{"$f":"Rep_Data!A52","v":"CLINTON,  SHAN"},{"$f":"Rep_Data!C52","v":"O77045"},{"$f":"Rep_Data!G52","v":"Columbia Station"},{"$f":"Rep_Data!H52","v":"OH"},{"$f":"Rep_Data!I52","v":"44028"},{"$f":"Rep_Data!J52","v":"Surgery"},{"$f":"IF(Rep_Data!N52 = 0, \"-\",IF(Rep_Data!N52 = \"\",\"-\",Rep_Data!N52))","v":"-"},{"$f":"IF(Rep_Data!O52 = 0, \"-\",IF(Rep_Data!O52 = \"\",\"-\",Rep_Data!O52))","v":"-"},{"$f":"IF(Rep_Data!P52 = 0, \"-\",IF(Rep_Data!P52 = \"\",\"-\",Rep_Data!P52))","v":"-"},{"$f":"IF(Rep_Data!Q52 = 0, \"-\",IF(Rep_Data!Q52 = \"\",\"-\",Rep_Data!Q52))","v":"-"},{"$f":"IF(Rep_Data!R52 = 0, \"-\",IF(Rep_Data!R52 = \"\",\"-\",Rep_Data!R52))","v":"-"},null,null,null,null,null,null,null,null,null,null,null,null,null,{"$f":"Table1[[#This Row],[Speciality]]&Table1[[#This Row],[Q1]]","v":"Surgery-"}]
[null,51,{"$f":"Rep_Data!A53","v":"CONCEPCION,  MARICA"},{"$f":"Rep_Data!C53","v":"O79960"},{"$f":"Rep_Data!G53","v":"Pittsfield"},{"$f":"Rep_Data!H53","v":"MA"},{"$f":"Rep_Data!I53","v":"01202"},{"$f":"Rep_Data!J53","v":"GP"},{"$f":"IF(Rep_Data!N53 = 0, \"-\",IF(Rep_Data!N53 = \"\",\"-\",Rep_Data!N53))","v":"-"},{"$f":"IF(Rep_Data!O53 = 0, \"-\",IF(Rep_Data!O53 = \"\",\"-\",Rep_Data!O53))","v":"-"},{"$f":"IF(Rep_Data!P53 = 0, \"-\",IF(Rep_Data!P53 = \"\",\"-\",Rep_Data!P53))","v":"-"},{"$f":"IF(Rep_Data!Q53 = 0, \"-\",IF(Rep_Data!Q53 = \"\",\"-\",Rep_Data!Q53))","v":"-"},{"$f":"IF(Rep_Data!R53 = 0, \"-\",IF(Rep_Data!R53 = \"\",\"-\",Rep_Data!R53))","v":"-"},null,null,null,null,null,null,null,null,null,null,null,null,null,{"$f":"Table1[[#This Row],[Speciality]]&Table1[[#This Row],[Q1]]","v":"GP-"}]
[null,52,{"$f":"Rep_Data!A54","v":"CONSUELO,  NOMA"},{"$f":"Rep_Data!C54","v":"O66819"},{"$f":"Rep_Data!G54","v":"Arabi"},{"$f":"Rep_Data!H54","v":"GA"},{"$f":"Rep_Data!I54","v":"31712"},{"$f":"Rep_Data!J54","v":"GP"},{"$f":"IF(Rep_Data!N54 = 0, \"-\",IF(Rep_Data!N54 = \"\",\"-\",Rep_Data!N54))","v":"-"},{"$f":"IF(Rep_Data!O54 = 0, \"-\",IF(Rep_Data!O54 = \"\",\"-\",Rep_Data!O54))","v":"-"},{"$f":"IF(Rep_Data!P54 = 0, \"-\",IF(Rep_Data!P54 = \"\",\"-\",Rep_Data!P54))","v":"-"},{"$f":"IF(Rep_Data!Q54 = 0, \"-\",IF(Rep_Data!Q54 = \"\",\"-\",Rep_Data!Q54))","v":"-"},{"$f":"IF(Rep_Data!R54 = 0, \"-\",IF(Rep_Data!R54 = \"\",\"-\",Rep_Data!R54))","v":"-"},null,null,null,null,null,null,null,null,null,null,null,null,null,{"$f":"Table1[[#This Row],[Speciality]]&Table1[[#This Row],[Q1]]","v":"GP-"}]
[null,53,{"$f":"Rep_Data!A55","v":"CORETTA,  JOEY"},{"$f":"Rep_Data!C55","v":"O64707"},{"$f":"Rep_Data!G55","v":"Campbell"},{"$f":"Rep_Data!H55","v":"MN"},{"$f":"Rep_Data!I55","v":"56522"},{"$f":"Rep_Data!J55","v":"GP"},{"$f":"IF(Rep_Data!N55 = 0, \"-\",IF(Rep_Data!N55 = \"\",\"-\",Rep_Data!N55))","v":"-"},{"$f":"IF(Rep_Data!O55 = 0, \"-\",IF(Rep_Data!O55 = \"\",\"-\",Rep_Data!O55))","v":"-"},{"$f":"IF(Rep_Data!P55 = 0, \"-\",IF(Rep_Data!P55 = \"\",\"-\",Rep_Data!P55))","v":"-"},{"$f":"IF(Rep_Data!Q55 = 0, \"-\",IF(Rep_Data!Q55 = \"\",\"-\",Rep_Data!Q55))","v":"-"},{"$f":"IF(Rep_Data!R55 = 0, \"-\",IF(Rep_Data!R55 = \"\",\"-\",Rep_Data!R55))","v":"-"},null,null,null,null,null,null,null,null,null,null,null,null,null,{"$f":"Table1[[#This Row],[Speciality]]&Table1[[#This Row],[Q1]]","v":"GP-"}]
[null,54,{"$f":"Rep_Data!A56","v":"CORRINE,  CASSIE"},{"$f":"Rep_Data!C56","v":"O63095"},{"$f":"Rep_Data!G56","v":"Rayne"},{"$f":"Rep_Data!H56","v":"LA"},{"$f":"Rep_Data!I56","v":"70578"},{"$f":"Rep_Data!J56","v":"GP"},{"$f":"IF(Rep_Data!N56 = 0, \"-\",IF(Rep_Data!N56 = \"\",\"-\",Rep_Data!N56))","v":"-"},{"$f":"IF(Rep_Data!O56 = 0, \"-\",IF(Rep_Data!O56 = \"\",\"-\",Rep_Data!O56))","v":"-"},{"$f":"IF(Rep_Data!P56 = 0, \"-\",IF(Rep_Data!P56 = \"\",\"-\",Rep_Data!P56))","v":"-"},{"$f":"IF(Rep_Data!Q56 = 0, \"-\",IF(Rep_Data!Q56 = \"\",\"-\",Rep_Data!Q56))","v":"-"},{"$f":"IF(Rep_Data!R56 = 0, \"-\",IF(Rep_Data!R56 = \"\",\"-\",Rep_Data!R56))","v":"-"},null,null,null,null,null,null,null,null,null,null,null,null,null,{"$f":"Table1[[#This Row],[Speciality]]&Table1[[#This Row],[Q1]]","v":"GP-"}]
[null,55,{"$f":"Rep_Data!A57","v":"CRISTOBAL,  SAMELLA"},{"$f":"Rep_Data!C57","v":"O79444"},{"$f":"Rep_Data!G57","v":"Ocean View"},{"$f":"Rep_Data!H57","v":"NJ"},{"$f":"Rep_Data!I57","v":"08230"},{"$f":"Rep_Data!J57","v":"GP"},{"$f":"IF(Rep_Data!N57 = 0, \"-\",IF(Rep_Data!N57 = \"\",\"-\",Rep_Data!N57))","v":"YES"},{"$f":"IF(Rep_Data!O57 = 0, \"-\",IF(Rep_Data!O57 = \"\",\"-\",Rep_Data!O57))","v":"1 - 2"},{"$f":"IF(Rep_Data!P57 = 0, \"-\",IF(Rep_Data!P57 = \"\",\"-\",Rep_Data!P57))","v":"NONE"},{"$f":"IF(Rep_Data!Q57 = 0, \"-\",IF(Rep_Data!Q57 = \"\",\"-\",Rep_Data!Q57))","v":"1"},{"$f":"IF(Rep_Data!R57 = 0, \"-\",IF(Rep_Data!R57 = \"\",\"-\",Rep_Data!R57))","v":"2 or Less"},null,null,null,null,null,null,null,null,null,null,null,null,null,{"$f":"Table1[[#This Row],[Speciality]]&Table1[[#This Row],[Q1]]","v":"GPYES"}]
[null,56,{"$f":"Rep_Data!A58","v":"CURTIS,  MYESHA"},{"$f":"Rep_Data!C58","v":"O59162"},{"$f":"Rep_Data!G58","v":"Egg Harbor City"},{"$f":"Rep_Data!H58","v":"NJ"},{"$f":"Rep_Data!I58","v":"08215"},{"$f":"Rep_Data!J58","v":"GP"},{"$f":"IF(Rep_Data!N58 = 0, \"-\",IF(Rep_Data!N58 = \"\",\"-\",Rep_Data!N58))","v":"-"},{"$f":"IF(Rep_Data!O58 = 0, \"-\",IF(Rep_Data!O58 = \"\",\"-\",Rep_Data!O58))","v":"-"},{"$f":"IF(Rep_Data!P58 = 0, \"-\",IF(Rep_Data!P58 = \"\",\"-\",Rep_Data!P58))","v":"-"},{"$f":"IF(Rep_Data!Q58 = 0, \"-\",IF(Rep_Data!Q58 = \"\",\"-\",Rep_Data!Q58))","v":"-"},{"$f":"IF(Rep_Data!R58 = 0, \"-\",IF(Rep_Data!R58 = \"\",\"-\",Rep_Data!R58))","v":"-"},null,null,null,null,null,null,null,null,null,null,null,null,null,{"$f":"Table1[[#This Row],[Speciality]]&Table1[[#This Row],[Q1]]","v":"GP-"}]
[null,57,{"$f":"Rep_Data!A59","v":"DANIEL,  MARIELA"},{"$f":"Rep_Data!C59","v":"O74331"},{"$f":"Rep_Data!G59","v":"Wasilla"},{"$f":"Rep_Data!H59","v":"AK"},{"$f":"Rep_Data!I59","v":"99654"},{"$f":"Rep_Data!J59","v":"GP"},{"$f":"IF(Rep_Data!N59 = 0, \"-\",IF(Rep_Data!N59 = \"\",\"-\",Rep_Data!N59))","v":"-"},{"$f":"IF(Rep_Data!O59 = 0, \"-\",IF(Rep_Data!O59 = \"\",\"-\",Rep_Data!O59))","v":"-"},{"$f":"IF(Rep_Data!P59 = 0, \"-\",IF(Rep_Data!P59 = \"\",\"-\",Rep_Data!P59))","v":"-"},{"$f":"IF(Rep_Data!Q59 = 0, \"-\",IF(Rep_Data!Q59 = \"\",\"-\",Rep_Data!Q59))","v":"-"},{"$f":"IF(Rep_Data!R59 = 0, \"-\",IF(Rep_Data!R59 = \"\",\"-\",Rep_Data!R59))","v":"-"},null,null,null,null,null,null,null,null,null,null,null,null,null,{"$f":"Table1[[#This Row],[Speciality]]&Table1[[#This Row],[Q1]]","v":"GP-"}]
[null,58,{"$f":"Rep_Data!A60","v":"DANNIE,  ALIX"},{"$f":"Rep_Data!C60","v":"O59472"},{"$f":"Rep_Data!G60","v":"Hamilton Dome"},{"$f":"Rep_Data!H60","v":"WY"},{"$f":"Rep_Data!I60","v":"82427"},{"$f":"Rep_Data!J60","v":"GP"},{"$f":"IF(Rep_Data!N60 = 0, \"-\",IF(Rep_Data!N60 = \"\",\"-\",Rep_Data!N60))","v":"YES"},{"$f":"IF(Rep_Data!O60 = 0, \"-\",IF(Rep_Data!O60 = \"\",\"-\",Rep_Data!O60))","v":"3 - 4"},{"$f":"IF(Rep_Data!P60 = 0, \"-\",IF(Rep_Data!P60 = \"\",\"-\",Rep_Data!P60))","v":"1 - 3"},{"$f":"IF(Rep_Data!Q60 = 0, \"-\",IF(Rep_Data!Q60 = \"\",\"-\",Rep_Data!Q60))","v":"2 - 3"},{"$f":"IF(Rep_Data!R60 = 0, \"-\",IF(Rep_Data!R60 = \"\",\"-\",Rep_Data!R60))","v":"More than 2"},null,null,null,null,null,null,null,null,null,null,null,null,null,{"$f":"Table1[[#This Row],[Speciality]]&Table1[[#This Row],[Q1]]","v":"GPYES"}]
[null,59,{"$f":"Rep_Data!A61","v":"DANUTA,  ENRIQUETA"},{"$f":"Rep_Data!C61","v":"O50024"},{"$f":"Rep_Data!G61","v":"Empire"},{"$f":"Rep_Data!H61","v":"CA"},{"$f":"Rep_Data!I61","v":"95319"},{"$f":"Rep_Data!J61","v":"Ortho"},{"$f":"IF(Rep_Data!N61 = 0, \"-\",IF(Rep_Data!N61 = \"\",\"-\",Rep_Data!N61))","v":"-"},{"$f":"IF(Rep_Data!O61 = 0, \"-\",IF(Rep_Data!O61 = \"\",\"-\",Rep_Data!O61))","v":"-"},{"$f":"IF(Rep_Data!P61 = 0, \"-\",IF(Rep_Data!P61 = \"\",\"-\",Rep_Data!P61))","v":"-"},{"$f":"IF(Rep_Data!Q61 = 0, \"-\",IF(Rep_Data!Q61 = \"\",\"-\",Rep_Data!Q61))","v":"-"},{"$f":"IF(Rep_Data!R61 = 0, \"-\",IF(Rep_Data!R61 = \"\",\"-\",Rep_Data!R61))","v":"-"},null,null,null,null,null,null,null,null,null,null,null,null,null,{"$f":"Table1[[#This Row],[Speciality]]&Table1[[#This Row],[Q1]]","v":"Ortho-"}]
[null,60,{"$f":"Rep_Data!A62","v":"DELORIS,  SANJUANA"},{"$f":"Rep_Data!C62","v":"O63478"},{"$f":"Rep_Data!G62","v":"Thornwood"},{"$f":"Rep_Data!H62","v":"NY"},{"$f":"Rep_Data!I62","v":"10594"},{"$f":"Rep_Data!J62","v":"GP"},{"$f":"IF(Rep_Data!N62 = 0, \"-\",IF(Rep_Data!N62 = \"\",\"-\",Rep_Data!N62))","v":"-"},{"$f":"IF(Rep_Data!O62 = 0, \"-\",IF(Rep_Data!O62 = \"\",\"-\",Rep_Data!O62))","v":"-"},{"$f":"IF(Rep_Data!P62 = 0, \"-\",IF(Rep_Data!P62 = \"\",\"-\",Rep_Data!P62))","v":"-"},{"$f":"IF(Rep_Data!Q62 = 0, \"-\",IF(Rep_Data!Q62 = \"\",\"-\",Rep_Data!Q62))","v":"-"},{"$f":"IF(Rep_Data!R62 = 0, \"-\",IF(Rep_Data!R62 = \"\",\"-\",Rep_Data!R62))","v":"-"},null,null,null,null,null,null,null,null,null,null,null,null,null,{"$f":"Table1[[#This Row],[Speciality]]&Table1[[#This Row],[Q1]]","v":"GP-"}]
[null,61,{"$f":"Rep_Data!A63","v":"DERRICK,  DELL"},{"$f":"Rep_Data!C63","v":"O79076"},{"$f":"Rep_Data!G63","v":"Callahan"},{"$f":"Rep_Data!H63","v":"FL"},{"$f":"Rep_Data!I63","v":"32011"},{"$f":"Rep_Data!J63","v":"GP"},{"$f":"IF(Rep_Data!N63 = 0, \"-\",IF(Rep_Data!N63 = \"\",\"-\",Rep_Data!N63))","v":"-"},{"$f":"IF(Rep_Data!O63 = 0, \"-\",IF(Rep_Data!O63 = \"\",\"-\",Rep_Data!O63))","v":"-"},{"$f":"IF(Rep_Data!P63 = 0, \"-\",IF(Rep_Data!P63 = \"\",\"-\",Rep_Data!P63))","v":"-"},{"$f":"IF(Rep_Data!Q63 = 0, \"-\",IF(Rep_Data!Q63 = \"\",\"-\",Rep_Data!Q63))","v":"-"},{"$f":"IF(Rep_Data!R63 = 0, \"-\",IF(Rep_Data!R63 = \"\",\"-\",Rep_Data!R63))","v":"-"},null,null,null,null,null,null,null,null,null,null,null,null,null,{"$f":"Table1[[#This Row],[Speciality]]&Table1[[#This Row],[Q1]]","v":"GP-"}]
[null,62,{"$f":"Rep_Data!A64","v":"DEWITT,  BETHANY"},{"$f":"Rep_Data!C64","v":"O66747"},{"$f":"Rep_Data!G64","v":"Tustin"},{"$f":"Rep_Data!H64","v":"MI"},{"$f":"Rep_Data!I64","v":"49688"},{"$f":"Rep_Data!J64","v":"GP"},{"$f":"IF(Rep_Data!N64 = 0, \"-\",IF(Rep_Data!N64 = \"\",\"-\",Rep_Data!N64))","v":"YES"},{"$f":"IF(Rep_Data!O64 = 0, \"-\",IF(Rep_Data!O64 = \"\",\"-\",Rep_Data!O64))","v":"1 - 2"},{"$f":"IF(Rep_Data!P64 = 0, \"-\",IF(Rep_Data!P64 = \"\",\"-\",Rep_Data!P64))","v":"NONE"},{"$f":"IF(Rep_Data!Q64 = 0, \"-\",IF(Rep_Data!Q64 = \"\",\"-\",Rep_Data!Q64))","v":"1"},{"$f":"IF(Rep_Data!R64 = 0, \"-\",IF(Rep_Data!R64 = \"\",\"-\",Rep_Data!R64))","v":"2 or Less"},null,null,null,null,null,null,null,null,null,null,null,null,null,{"$f":"Table1[[#This Row],[Speciality]]&Table1[[#This Row],[Q1]]","v":"GPYES"}]
[null,63,{"$f":"Rep_Data!A65","v":"DEXTER,  RENALDO"},{"$f":"Rep_Data!C65","v":"O51555"},{"$f":"Rep_Data!G65","v":"Brandon"},{"$f":"Rep_Data!H65","v":"SD"},{"$f":"Rep_Data!I65","v":"57005"},{"$f":"Rep_Data!J65","v":"GP"},{"$f":"IF(Rep_Data!N65 = 0, \"-\",IF(Rep_Data!N65 = \"\",\"-\",Rep_Data!N65))","v":"YES"},{"$f":"IF(Rep_Data!O65 = 0, \"-\",IF(Rep_Data!O65 = \"\",\"-\",Rep_Data!O65))","v":"3 - 4"},{"$f":"IF(Rep_Data!P65 = 0, \"-\",IF(Rep_Data!P65 = \"\",\"-\",Rep_Data!P65))","v":"1 - 3"},{"$f":"IF(Rep_Data!Q65 = 0, \"-\",IF(Rep_Data!Q65 = \"\",\"-\",Rep_Data!Q65))","v":"2 - 3"},{"$f":"IF(Rep_Data!R65 = 0, \"-\",IF(Rep_Data!R65 = \"\",\"-\",Rep_Data!R65))","v":"More than 2"},null,null,null,null,null,null,null,null,null,null,null,null,null,{"$f":"Table1[[#This Row],[Speciality]]&Table1[[#This Row],[Q1]]","v":"GPYES"}]
[null,64,{"$f":"Rep_Data!A66","v":"DIANNE,  LYNDSAY"},{"$f":"Rep_Data!C66","v":"O50217"},{"$f":"Rep_Data!G66","v":"Belford"},{"$f":"Rep_Data!H66","v":"NJ"},{"$f":"Rep_Data!I66","v":"07718"},{"$f":"Rep_Data!J66","v":"Ortho"},{"$f":"IF(Rep_Data!N66 = 0, \"-\",IF(Rep_Data!N66 = \"\",\"-\",Rep_Data!N66))","v":"-"},{"$f":"IF(Rep_Data!O66 = 0, \"-\",IF(Rep_Data!O66 = \"\",\"-\",Rep_Data!O66))","v":"-"},{"$f":"IF(Rep_Data!P66 = 0, \"-\",IF(Rep_Data!P66 = \"\",\"-\",Rep_Data!P66))","v":"-"},{"$f":"IF(Rep_Data!Q66 = 0, \"-\",IF(Rep_Data!Q66 = \"\",\"-\",Rep_Data!Q66))","v":"-"},{"$f":"IF(Rep_Data!R66 = 0, \"-\",IF(Rep_Data!R66 = \"\",\"-\",Rep_Data!R66))","v":"-"},null,null,null,null,null,null,null,null,null,null,null,null,null,{"$f":"Table1[[#This Row],[Speciality]]&Table1[[#This Row],[Q1]]","v":"Ortho-"}]
[null,65,{"$f":"Rep_Data!A67","v":"DICK,  FLAVIA"},{"$f":"Rep_Data!C67","v":"O68382"},{"$f":"Rep_Data!G67","v":"Chatawa"},{"$f":"Rep_Data!H67","v":"MS"},{"$f":"Rep_Data!I67","v":"39632"},{"$f":"Rep_Data!J67","v":"Ortho"},{"$f":"IF(Rep_Data!N67 = 0, \"-\",IF(Rep_Data!N67 = \"\",\"-\",Rep_Data!N67))","v":"-"},{"$f":"IF(Rep_Data!O67 = 0, \"-\",IF(Rep_Data!O67 = \"\",\"-\",Rep_Data!O67))","v":"-"},{"$f":"IF(Rep_Data!P67 = 0, \"-\",IF(Rep_Data!P67 = \"\",\"-\",Rep_Data!P67))","v":"-"},{"$f":"IF(Rep_Data!Q67 = 0, \"-\",IF(Rep_Data!Q67 = \"\",\"-\",Rep_Data!Q67))","v":"-"},{"$f":"IF(Rep_Data!R67 = 0, \"-\",IF(Rep_Data!R67 = \"\",\"-\",Rep_Data!R67))","v":"-"},null,null,null,null,null,null,null,null,null,null,null,null,null,{"$f":"Table1[[#This Row],[Speciality]]&Table1[[#This Row],[Q1]]","v":"Ortho-"}]
[null,66,{"$f":"Rep_Data!A68","v":"DORIAN,  ELIZBETH"},{"$f":"Rep_Data!C68","v":"O55017"},{"$f":"Rep_Data!G68","v":"Pavo"},{"$f":"Rep_Data!H68","v":"GA"},{"$f":"Rep_Data!I68","v":"31778"},{"$f":"Rep_Data!J68","v":"Surgery"},{"$f":"IF(Rep_Data!N68 = 0, \"-\",IF(Rep_Data!N68 = \"\",\"-\",Rep_Data!N68))","v":"-"},{"$f":"IF(Rep_Data!O68 = 0, \"-\",IF(Rep_Data!O68 = \"\",\"-\",Rep_Data!O68))","v":"-"},{"$f":"IF(Rep_Data!P68 = 0, \"-\",IF(Rep_Data!P68 = \"\",\"-\",Rep_Data!P68))","v":"-"},{"$f":"IF(Rep_Data!Q68 = 0, \"-\",IF(Rep_Data!Q68 = \"\",\"-\",Rep_Data!Q68))","v":"-"},{"$f":"IF(Rep_Data!R68 = 0, \"-\",IF(Rep_Data!R68 = \"\",\"-\",Rep_Data!R68))","v":"-"},null,null,null,null,null,null,null,null,null,null,null,null,null,{"$f":"Table1[[#This Row],[Speciality]]&Table1[[#This Row],[Q1]]","v":"Surgery-"}]
[null,67,{"$f":"Rep_Data!A69","v":"DORINDA,  FREDIA"},{"$f":"Rep_Data!C69","v":"O53143"},{"$f":"Rep_Data!G69","v":"Elliott"},{"$f":"Rep_Data!H69","v":"SC"},{"$f":"Rep_Data!I69","v":"29046"},{"$f":"Rep_Data!J69","v":"GP"},{"$f":"IF(Rep_Data!N69 = 0, \"-\",IF(Rep_Data!N69 = \"\",\"-\",Rep_Data!N69))","v":"-"},{"$f":"IF(Rep_Data!O69 = 0, \"-\",IF(Rep_Data!O69 = \"\",\"-\",Rep_Data!O69))","v":"-"},{"$f":"IF(Rep_Data!P69 = 0, \"-\",IF(Rep_Data!P69 = \"\",\"-\",Rep_Data!P69))","v":"-"},{"$f":"IF(Rep_Data!Q69 = 0, \"-\",IF(Rep_Data!Q69 = \"\",\"-\",Rep_Data!Q69))","v":"-"},{"$f":"IF(Rep_Data!R69 = 0, \"-\",IF(Rep_Data!R69 = \"\",\"-\",Rep_Data!R69))","v":"-"},null,null,null,null,null,null,null,null,null,null,null,null,null,{"$f":"Table1[[#This Row],[Speciality]]&Table1[[#This Row],[Q1]]","v":"GP-"}]
[null,68,{"$f":"Rep_Data!A70","v":"DORTHEY,  THELMA"},{"$f":"Rep_Data!C70","v":"O60917"},{"$f":"Rep_Data!G70","v":"Columbia"},{"$f":"Rep_Data!H70","v":"IL"},{"$f":"Rep_Data!I70","v":"62236"},{"$f":"Rep_Data!J70","v":"GP"},{"$f":"IF(Rep_Data!N70 = 0, \"-\",IF(Rep_Data!N70 = \"\",\"-\",Rep_Data!N70))","v":"YES"},{"$f":"IF(Rep_Data!O70 = 0, \"-\",IF(Rep_Data!O70 = \"\",\"-\",Rep_Data!O70))","v":"3 - 4"},{"$f":"IF(Rep_Data!P70 = 0, \"-\",IF(Rep_Data!P70 = \"\",\"-\",Rep_Data!P70))","v":"1 - 3"},{"$f":"IF(Rep_Data!Q70 = 0, \"-\",IF(Rep_Data!Q70 = \"\",\"-\",Rep_Data!Q70))","v":"2 - 3"},{"$f":"IF(Rep_Data!R70 = 0, \"-\",IF(Rep_Data!R70 = \"\",\"-\",Rep_Data!R70))","v":"More than 2"},null,null,null,null,null,null,null,null,null,null,null,null,null,{"$f":"Table1[[#This Row],[Speciality]]&Table1[[#This Row],[Q1]]","v":"GPYES"}]
[null,69,{"$f":"Rep_Data!A71","v":"DOUG,  LEO"},{"$f":"Rep_Data!C71","v":"O58292"},{"$f":"Rep_Data!G71","v":"Tiverton"},{"$f":"Rep_Data!H71","v":"RI"},{"$f":"Rep_Data!I71","v":"02878"},{"$f":"Rep_Data!J71","v":"GP"},{"$f":"IF(Rep_Data!N71 = 0, \"-\",IF(Rep_Data!N71 = \"\",\"-\",Rep_Data!N71))","v":"-"},{"$f":"IF(Rep_Data!O71 = 0, \"-\",IF(Rep_Data!O71 = \"\",\"-\",Rep_Data!O71))","v":"-"},{"$f":"IF(Rep_Data!P71 = 0, \"-\",IF(Rep_Data!P71 = \"\",\"-\",Rep_Data!P71))","v":"-"},{"$f":"IF(Rep_Data!Q71 = 0, \"-\",IF(Rep_Data!Q71 = \"\",\"-\",Rep_Data!Q71))","v":"-"},{"$f":"IF(Rep_Data!R71 = 0, \"-\",IF(Rep_Data!R71 = \"\",\"-\",Rep_Data!R71))","v":"-"},null,null,null,null,null,null,null,null,null,null,null,null,null,{"$f":"Table1[[#This Row],[Speciality]]&Table1[[#This Row],[Q1]]","v":"GP-"}]
[null,70,{"$f":"Rep_Data!A72","v":"EASTER,  YUK"},{"$f":"Rep_Data!C72","v":"O55115"},{"$f":"Rep_Data!G72","v":"Princeton"},{"$f":"Rep_Data!H72","v":"CA"},{"$f":"Rep_Data!I72","v":"95970"},{"$f":"Rep_Data!J72","v":"GP"},{"$f":"IF(Rep_Data!N72 = 0, \"-\",IF(Rep_Data!N72 = \"\",\"-\",Rep_Data!N72))","v":"-"},{"$f":"IF(Rep_Data!O72 = 0, \"-\",IF(Rep_Data!O72 = \"\",\"-\",Rep_Data!O72))","v":"-"},{"$f":"IF(Rep_Data!P72 = 0, \"-\",IF(Rep_Data!P72 = \"\",\"-\",Rep_Data!P72))","v":"-"},{"$f":"IF(Rep_Data!Q72 = 0, \"-\",IF(Rep_Data!Q72 = \"\",\"-\",Rep_Data!Q72))","v":"-"},{"$f":"IF(Rep_Data!R72 = 0, \"-\",IF(Rep_Data!R72 = \"\",\"-\",Rep_Data!R72))","v":"-"},null,null,null,null,null,null,null,null,null,null,null,null,null,{"$f":"Table1[[#This Row],[Speciality]]&Table1[[#This Row],[Q1]]","v":"GP-"}]
[null,71,{"$f":"Rep_Data!A73","v":"ELINOR,  JEANMARIE"},{"$f":"Rep_Data!C73","v":"O52424"},{"$f":"Rep_Data!G73","v":"Mc Donald"},{"$f":"Rep_Data!H73","v":"OH"},{"$f":"Rep_Data!I73","v":"44437"},{"$f":"Rep_Data!J73","v":"Ortho"},{"$f":"IF(Rep_Data!N73 = 0, \"-\",IF(Rep_Data!N73 = \"\",\"-\",Rep_Data!N73))","v":"-"},{"$f":"IF(Rep_Data!O73 = 0, \"-\",IF(Rep_Data!O73 = \"\",\"-\",Rep_Data!O73))","v":"-"},{"$f":"IF(Rep_Data!P73 = 0, \"-\",IF(Rep_Data!P73 = \"\",\"-\",Rep_Data!P73))","v":"-"},{"$f":"IF(Rep_Data!Q73 = 0, \"-\",IF(Rep_Data!Q73 = \"\",\"-\",Rep_Data!Q73))","v":"-"},{"$f":"IF(Rep_Data!R73 = 0, \"-\",IF(Rep_Data!R73 = \"\",\"-\",Rep_Data!R73))","v":"-"},null,null,null,null,null,null,null,null,null,null,null,null,null,{"$f":"Table1[[#This Row],[Speciality]]&Table1[[#This Row],[Q1]]","v":"Ortho-"}]
[null,72,{"$f":"Rep_Data!A74","v":"ELISHA,  ROSEANNA"},{"$f":"Rep_Data!C74","v":"O67245"},{"$f":"Rep_Data!G74","v":"Crawfordville"},{"$f":"Rep_Data!H74","v":"FL"},{"$f":"Rep_Data!I74","v":"32327"},{"$f":"Rep_Data!J74","v":"GP"},{"$f":"IF(Rep_Data!N74 = 0, \"-\",IF(Rep_Data!N74 = \"\",\"-\",Rep_Data!N74))","v":"YES"},{"$f":"IF(Rep_Data!O74 = 0, \"-\",IF(Rep_Data!O74 = \"\",\"-\",Rep_Data!O74))","v":"NONE"},{"$f":"IF(Rep_Data!P74 = 0, \"-\",IF(Rep_Data!P74 = \"\",\"-\",Rep_Data!P74))","v":"NONE"},{"$f":"IF(Rep_Data!Q74 = 0, \"-\",IF(Rep_Data!Q74 = \"\",\"-\",Rep_Data!Q74))","v":"2 - 3"},{"$f":"IF(Rep_Data!R74 = 0, \"-\",IF(Rep_Data!R74 = \"\",\"-\",Rep_Data!R74))","v":"More than 2"},null,null,null,null,null,null,null,null,null,null,null,null,null,{"$f":"Table1[[#This Row],[Speciality]]&Table1[[#This Row],[Q1]]","v":"GPYES"}]
[null,73,{"$f":"Rep_Data!A75","v":"ELKE,  KASIE"},{"$f":"Rep_Data!C75","v":"O68966"},{"$f":"Rep_Data!G75","v":"Gifford"},{"$f":"Rep_Data!H75","v":"SC"},{"$f":"Rep_Data!I75","v":"29923"},{"$f":"Rep_Data!J75","v":"GP"},{"$f":"IF(Rep_Data!N75 = 0, \"-\",IF(Rep_Data!N75 = \"\",\"-\",Rep_Data!N75))","v":"-"},{"$f":"IF(Rep_Data!O75 = 0, \"-\",IF(Rep_Data!O75 = \"\",\"-\",Rep_Data!O75))","v":"-"},{"$f":"IF(Rep_Data!P75 = 0, \"-\",IF(Rep_Data!P75 = \"\",\"-\",Rep_Data!P75))","v":"-"},{"$f":"IF(Rep_Data!Q75 = 0, \"-\",IF(Rep_Data!Q75 = \"\",\"-\",Rep_Data!Q75))","v":"-"},{"$f":"IF(Rep_Data!R75 = 0, \"-\",IF(Rep_Data!R75 = \"\",\"-\",Rep_Data!R75))","v":"-"},null,null,null,null,null,null,null,null,null,null,null,null,null,{"$f":"Table1[[#This Row],[Speciality]]&Table1[[#This Row],[Q1]]","v":"GP-"}]
[null,74,{"$f":"Rep_Data!A76","v":"ELLAN,  MILES"},{"$f":"Rep_Data!C76","v":"O68500"},{"$f":"Rep_Data!G76","v":"Jacob"},{"$f":"Rep_Data!H76","v":"IL"},{"$f":"Rep_Data!I76","v":"62950"},{"$f":"Rep_Data!J76","v":"GP"},{"$f":"IF(Rep_Data!N76 = 0, \"-\",IF(Rep_Data!N76 = \"\",\"-\",Rep_Data!N76))","v":"-"},{"$f":"IF(Rep_Data!O76 = 0, \"-\",IF(Rep_Data!O76 = \"\",\"-\",Rep_Data!O76))","v":"-"},{"$f":"IF(Rep_Data!P76 = 0, \"-\",IF(Rep_Data!P76 = \"\",\"-\",Rep_Data!P76))","v":"-"},{"$f":"IF(Rep_Data!Q76 = 0, \"-\",IF(Rep_Data!Q76 = \"\",\"-\",Rep_Data!Q76))","v":"-"},{"$f":"IF(Rep_Data!R76 = 0, \"-\",IF(Rep_Data!R76 = \"\",\"-\",Rep_Data!R76))","v":"-"},null,null,null,null,null,null,null,null,null,null,null,null,null,{"$f":"Table1[[#This Row],[Speciality]]&Table1[[#This Row],[Q1]]","v":"GP-"}]
[null,75,{"$f":"Rep_Data!A77","v":"ELODIA,  DEREK"},{"$f":"Rep_Data!C77","v":"O58818"},{"$f":"Rep_Data!G77","v":"Florence"},{"$f":"Rep_Data!H77","v":"KY"},{"$f":"Rep_Data!I77","v":"41022"},{"$f":"Rep_Data!J77","v":"Surgery"},{"$f":"IF(Rep_Data!N77 = 0, \"-\",IF(Rep_Data!N77 = \"\",\"-\",Rep_Data!N77))","v":"YES"},{"$f":"IF(Rep_Data!O77 = 0, \"-\",IF(Rep_Data!O77 = \"\",\"-\",Rep_Data!O77))","v":"1 - 2"},{"$f":"IF(Rep_Data!P77 = 0, \"-\",IF(Rep_Data!P77 = \"\",\"-\",Rep_Data!P77))","v":"NONE"},{"$f":"IF(Rep_Data!Q77 = 0, \"-\",IF(Rep_Data!Q77 = \"\",\"-\",Rep_Data!Q77))","v":"1"},{"$f":"IF(Rep_Data!R77 = 0, \"-\",IF(Rep_Data!R77 = \"\",\"-\",Rep_Data!R77))","v":"2 or Less"},null,null,null,null,null,null,null,null,null,null,null,null,null,{"$f":"Table1[[#This Row],[Speciality]]&Table1[[#This Row],[Q1]]","v":"SurgeryYES"}]
[null,76,{"$f":"Rep_Data!A78","v":"ELOUISE,  THRESA"},{"$f":"Rep_Data!C78","v":"O66803"},{"$f":"Rep_Data!G78","v":"Westwego"},{"$f":"Rep_Data!H78","v":"LA"},{"$f":"Rep_Data!I78","v":"70094"},{"$f":"Rep_Data!J78","v":"Ortho"},{"$f":"IF(Rep_Data!N78 = 0, \"-\",IF(Rep_Data!N78 = \"\",\"-\",Rep_Data!N78))","v":"-"},{"$f":"IF(Rep_Data!O78 = 0, \"-\",IF(Rep_Data!O78 = \"\",\"-\",Rep_Data!O78))","v":"-"},{"$f":"IF(Rep_Data!P78 = 0, \"-\",IF(Rep_Data!P78 = \"\",\"-\",Rep_Data!P78))","v":"-"},{"$f":"IF(Rep_Data!Q78 = 0, \"-\",IF(Rep_Data!Q78 = \"\",\"-\",Rep_Data!Q78))","v":"-"},{"$f":"IF(Rep_Data!R78 = 0, \"-\",IF(Rep_Data!R78 = \"\",\"-\",Rep_Data!R78))","v":"-"},null,null,null,null,null,null,null,null,null,null,null,null,null,{"$f":"Table1[[#This Row],[Speciality]]&Table1[[#This Row],[Q1]]","v":"Ortho-"}]
[null,77,{"$f":"Rep_Data!A79","v":"ELSY,  JILL"},{"$f":"Rep_Data!C79","v":"O50249"},{"$f":"Rep_Data!G79","v":"Dothan"},{"$f":"Rep_Data!H79","v":"AL"},{"$f":"Rep_Data!I79","v":"36305"},{"$f":"Rep_Data!J79","v":"GP"},{"$f":"IF(Rep_Data!N79 = 0, \"-\",IF(Rep_Data!N79 = \"\",\"-\",Rep_Data!N79))","v":"-"},{"$f":"IF(Rep_Data!O79 = 0, \"-\",IF(Rep_Data!O79 = \"\",\"-\",Rep_Data!O79))","v":"-"},{"$f":"IF(Rep_Data!P79 = 0, \"-\",IF(Rep_Data!P79 = \"\",\"-\",Rep_Data!P79))","v":"-"},{"$f":"IF(Rep_Data!Q79 = 0, \"-\",IF(Rep_Data!Q79 = \"\",\"-\",Rep_Data!Q79))","v":"-"},{"$f":"IF(Rep_Data!R79 = 0, \"-\",IF(Rep_Data!R79 = \"\",\"-\",Rep_Data!R79))","v":"-"},null,null,null,null,null,null,null,null,null,null,null,null,null,{"$f":"Table1[[#This Row],[Speciality]]&Table1[[#This Row],[Q1]]","v":"GP-"}]
[null,78,{"$f":"Rep_Data!A80","v":"EMA,  TATUM"},{"$f":"Rep_Data!C80","v":"O65812"},{"$f":"Rep_Data!G80","v":"Bluff"},{"$f":"Rep_Data!H80","v":"UT"},{"$f":"Rep_Data!I80","v":"84512"},{"$f":"Rep_Data!J80","v":"GP"},{"$f":"IF(Rep_Data!N80 = 0, \"-\",IF(Rep_Data!N80 = \"\",\"-\",Rep_Data!N80))","v":"-"},{"$f":"IF(Rep_Data!O80 = 0, \"-\",IF(Rep_Data!O80 = \"\",\"-\",Rep_Data!O80))","v":"-"},{"$f":"IF(Rep_Data!P80 = 0, \"-\",IF(Rep_Data!P80 = \"\",\"-\",Rep_Data!P80))","v":"-"},{"$f":"IF(Rep_Data!Q80 = 0, \"-\",IF(Rep_Data!Q80 = \"\",\"-\",Rep_Data!Q80))","v":"-"},{"$f":"IF(Rep_Data!R80 = 0, \"-\",IF(Rep_Data!R80 = \"\",\"-\",Rep_Data!R80))","v":"-"},null,null,null,null,null,null,null,null,null,null,null,null,null,{"$f":"Table1[[#This Row],[Speciality]]&Table1[[#This Row],[Q1]]","v":"GP-"}]
[null,79,{"$f":"Rep_Data!A81","v":"EMERALD,  VERONICA"},{"$f":"Rep_Data!C81","v":"O51734"},{"$f":"Rep_Data!G81","v":"North Adams"},{"$f":"Rep_Data!H81","v":"MI"},{"$f":"Rep_Data!I81","v":"49262"},{"$f":"Rep_Data!J81","v":"GP"},{"$f":"IF(Rep_Data!N81 = 0, \"-\",IF(Rep_Data!N81 = \"\",\"-\",Rep_Data!N81))","v":"-"},{"$f":"IF(Rep_Data!O81 = 0, \"-\",IF(Rep_Data!O81 = \"\",\"-\",Rep_Data!O81))","v":"-"},{"$f":"IF(Rep_Data!P81 = 0, \"-\",IF(Rep_Data!P81 = \"\",\"-\",Rep_Data!P81))","v":"-"},{"$f":"IF(Rep_Data!Q81 = 0, \"-\",IF(Rep_Data!Q81 = \"\",\"-\",Rep_Data!Q81))","v":"-"},{"$f":"IF(Rep_Data!R81 = 0, \"-\",IF(Rep_Data!R81 = \"\",\"-\",Rep_Data!R81))","v":"-"},null,null,null,null,null,null,null,null,null,null,null,null,null,{"$f":"Table1[[#This Row],[Speciality]]&Table1[[#This Row],[Q1]]","v":"GP-"}]
[null,80,{"$f":"Rep_Data!A82","v":"EMERITA,  DELINDA"},{"$f":"Rep_Data!C82","v":"O70232"},{"$f":"Rep_Data!G82","v":"Anderson"},{"$f":"Rep_Data!H82","v":"IN"},{"$f":"Rep_Data!I82","v":"46013"},{"$f":"Rep_Data!J82","v":"Ortho"},{"$f":"IF(Rep_Data!N82 = 0, \"-\",IF(Rep_Data!N82 = \"\",\"-\",Rep_Data!N82))","v":"-"},{"$f":"IF(Rep_Data!O82 = 0, \"-\",IF(Rep_Data!O82 = \"\",\"-\",Rep_Data!O82))","v":"-"},{"$f":"IF(Rep_Data!P82 = 0, \"-\",IF(Rep_Data!P82 = \"\",\"-\",Rep_Data!P82))","v":"-"},{"$f":"IF(Rep_Data!Q82 = 0, \"-\",IF(Rep_Data!Q82 = \"\",\"-\",Rep_Data!Q82))","v":"-"},{"$f":"IF(Rep_Data!R82 = 0, \"-\",IF(Rep_Data!R82 = \"\",\"-\",Rep_Data!R82))","v":"-"},null,null,null,null,null,null,null,null,null,null,null,null,null,{"$f":"Table1[[#This Row],[Speciality]]&Table1[[#This Row],[Q1]]","v":"Ortho-"}]
[null,81,{"$f":"Rep_Data!A83","v":"EMIL,  SOLEDAD"},{"$f":"Rep_Data!C83","v":"O79708"},{"$f":"Rep_Data!G83","v":"Cochiti Pueblo"},{"$f":"Rep_Data!H83","v":"NM"},{"$f":"Rep_Data!I83","v":"87072"},{"$f":"Rep_Data!J83","v":"GP"},{"$f":"IF(Rep_Data!N83 = 0, \"-\",IF(Rep_Data!N83 = \"\",\"-\",Rep_Data!N83))","v":"YES"},{"$f":"IF(Rep_Data!O83 = 0, \"-\",IF(Rep_Data!O83 = \"\",\"-\",Rep_Data!O83))","v":"3 - 4"},{"$f":"IF(Rep_Data!P83 = 0, \"-\",IF(Rep_Data!P83 = \"\",\"-\",Rep_Data!P83))","v":"1 - 3"},{"$f":"IF(Rep_Data!Q83 = 0, \"-\",IF(Rep_Data!Q83 = \"\",\"-\",Rep_Data!Q83))","v":"2 - 3"},{"$f":"IF(Rep_Data!R83 = 0, \"-\",IF(Rep_Data!R83 = \"\",\"-\",Rep_Data!R83))","v":"More than 2"},null,null,null,null,null,null,null,null,null,null,null,null,null,{"$f":"Table1[[#This Row],[Speciality]]&Table1[[#This Row],[Q1]]","v":"GPYES"}]
[null,82,{"$f":"Rep_Data!A84","v":"ENOLA,  ALYSHA"},{"$f":"Rep_Data!C84","v":"O67414"},{"$f":"Rep_Data!G84","v":"Hogansburg"},{"$f":"Rep_Data!H84","v":"NY"},{"$f":"Rep_Data!I84","v":"13655"},{"$f":"Rep_Data!J84","v":"GP"},{"$f":"IF(Rep_Data!N84 = 0, \"-\",IF(Rep_Data!N84 = \"\",\"-\",Rep_Data!N84))","v":"YES"},{"$f":"IF(Rep_Data!O84 = 0, \"-\",IF(Rep_Data!O84 = \"\",\"-\",Rep_Data!O84))","v":"3 - 4"},{"$f":"IF(Rep_Data!P84 = 0, \"-\",IF(Rep_Data!P84 = \"\",\"-\",Rep_Data!P84))","v":"1 - 3"},{"$f":"IF(Rep_Data!Q84 = 0, \"-\",IF(Rep_Data!Q84 = \"\",\"-\",Rep_Data!Q84))","v":"2 - 3"},{"$f":"IF(Rep_Data!R84 = 0, \"-\",IF(Rep_Data!R84 = \"\",\"-\",Rep_Data!R84))","v":"More than 2"},null,null,null,null,null,null,null,null,null,null,null,null,null,{"$f":"Table1[[#This Row],[Speciality]]&Table1[[#This Row],[Q1]]","v":"GPYES"}]
[null,83,{"$f":"Rep_Data!A85","v":"ERLINE,  PATRICK"},{"$f":"Rep_Data!C85","v":"O55710"},{"$f":"Rep_Data!G85","v":"Cambria"},{"$f":"Rep_Data!H85","v":"CA"},{"$f":"Rep_Data!I85","v":"93428"},{"$f":"Rep_Data!J85","v":"Surgery"},{"$f":"IF(Rep_Data!N85 = 0, \"-\",IF(Rep_Data!N85 = \"\",\"-\",Rep_Data!N85))","v":"YES"},{"$f":"IF(Rep_Data!O85 = 0, \"-\",IF(Rep_Data!O85 = \"\",\"-\",Rep_Data!O85))","v":"3 - 4"},{"$f":"IF(Rep_Data!P85 = 0, \"-\",IF(Rep_Data!P85 = \"\",\"-\",Rep_Data!P85))","v":"1 - 3"},{"$f":"IF(Rep_Data!Q85 = 0, \"-\",IF(Rep_Data!Q85 = \"\",\"-\",Rep_Data!Q85))","v":"2 - 3"},{"$f":"IF(Rep_Data!R85 = 0, \"-\",IF(Rep_Data!R85 = \"\",\"-\",Rep_Data!R85))","v":"More than 2"},null,null,null,null,null,null,null,null,null,null,null,null,null,{"$f":"Table1[[#This Row],[Speciality]]&Table1[[#This Row],[Q1]]","v":"SurgeryYES"}]
[null,84,{"$f":"Rep_Data!A86","v":"ESTELA,  THUY"},{"$f":"Rep_Data!C86","v":"O71638"},{"$f":"Rep_Data!G86","v":"Phoenix"},{"$f":"Rep_Data!H86","v":"AZ"},{"$f":"Rep_Data!I86","v":"85025"},{"$f":"Rep_Data!J86","v":"GP"},{"$f":"IF(Rep_Data!N86 = 0, \"-\",IF(Rep_Data!N86 = \"\",\"-\",Rep_Data!N86))","v":"-"},{"$f":"IF(Rep_Data!O86 = 0, \"-\",IF(Rep_Data!O86 = \"\",\"-\",Rep_Data!O86))","v":"-"},{"$f":"IF(Rep_Data!P86 = 0, \"-\",IF(Rep_Data!P86 = \"\",\"-\",Rep_Data!P86))","v":"-"},{"$f":"IF(Rep_Data!Q86 = 0, \"-\",IF(Rep_Data!Q86 = \"\",\"-\",Rep_Data!Q86))","v":"-"},{"$f":"IF(Rep_Data!R86 = 0, \"-\",IF(Rep_Data!R86 = \"\",\"-\",Rep_Data!R86))","v":"-"},null,null,null,null,null,null,null,null,null,null,null,null,null,{"$f":"Table1[[#This Row],[Speciality]]&Table1[[#This Row],[Q1]]","v":"GP-"}]
[null,85,{"$f":"Rep_Data!A87","v":"ETHA,  KAZUKO"},{"$f":"Rep_Data!C87","v":"O61792"},{"$f":"Rep_Data!G87","v":"Linden"},{"$f":"Rep_Data!H87","v":"NC"},{"$f":"Rep_Data!I87","v":"28356"},{"$f":"Rep_Data!J87","v":"Surgery"},{"$f":"IF(Rep_Data!N87 = 0, \"-\",IF(Rep_Data!N87 = \"\",\"-\",Rep_Data!N87))","v":"-"},{"$f":"IF(Rep_Data!O87 = 0, \"-\",IF(Rep_Data!O87 = \"\",\"-\",Rep_Data!O87))","v":"-"},{"$f":"IF(Rep_Data!P87 = 0, \"-\",IF(Rep_Data!P87 = \"\",\"-\",Rep_Data!P87))","v":"-"},{"$f":"IF(Rep_Data!Q87 = 0, \"-\",IF(Rep_Data!Q87 = \"\",\"-\",Rep_Data!Q87))","v":"-"},{"$f":"IF(Rep_Data!R87 = 0, \"-\",IF(Rep_Data!R87 = \"\",\"-\",Rep_Data!R87))","v":"-"},null,null,null,null,null,null,null,null,null,null,null,null,null,{"$f":"Table1[[#This Row],[Speciality]]&Table1[[#This Row],[Q1]]","v":"Surgery-"}]
[null,86,{"$f":"Rep_Data!A88","v":"FANNIE,  ADELL"},{"$f":"Rep_Data!C88","v":"O57731"},{"$f":"Rep_Data!G88","v":"Bristol"},{"$f":"Rep_Data!H88","v":"VA"},{"$f":"Rep_Data!I88","v":"24201"},{"$f":"Rep_Data!J88","v":"GP"},{"$f":"IF(Rep_Data!N88 = 0, \"-\",IF(Rep_Data!N88 = \"\",\"-\",Rep_Data!N88))","v":"-"},{"$f":"IF(Rep_Data!O88 = 0, \"-\",IF(Rep_Data!O88 = \"\",\"-\",Rep_Data!O88))","v":"-"},{"$f":"IF(Rep_Data!P88 = 0, \"-\",IF(Rep_Data!P88 = \"\",\"-\",Rep_Data!P88))","v":"-"},{"$f":"IF(Rep_Data!Q88 = 0, \"-\",IF(Rep_Data!Q88 = \"\",\"-\",Rep_Data!Q88))","v":"-"},{"$f":"IF(Rep_Data!R88 = 0, \"-\",IF(Rep_Data!R88 = \"\",\"-\",Rep_Data!R88))","v":"-"},null,null,null,null,null,null,null,null,null,null,null,null,null,{"$f":"Table1[[#This Row],[Speciality]]&Table1[[#This Row],[Q1]]","v":"GP-"}]
[null,87,{"$f":"Rep_Data!A89","v":"FELICIA,  CARLY"},{"$f":"Rep_Data!C89","v":"O55326"},{"$f":"Rep_Data!G89","v":"Thibodaux"},{"$f":"Rep_Data!H89","v":"LA"},{"$f":"Rep_Data!I89","v":"70301"},{"$f":"Rep_Data!J89","v":"GP"},{"$f":"IF(Rep_Data!N89 = 0, \"-\",IF(Rep_Data!N89 = \"\",\"-\",Rep_Data!N89))","v":"YES"},{"$f":"IF(Rep_Data!O89 = 0, \"-\",IF(Rep_Data!O89 = \"\",\"-\",Rep_Data!O89))","v":"1 - 2"},{"$f":"IF(Rep_Data!P89 = 0, \"-\",IF(Rep_Data!P89 = \"\",\"-\",Rep_Data!P89))","v":"NONE"},{"$f":"IF(Rep_Data!Q89 = 0, \"-\",IF(Rep_Data!Q89 = \"\",\"-\",Rep_Data!Q89))","v":"1"},{"$f":"IF(Rep_Data!R89 = 0, \"-\",IF(Rep_Data!R89 = \"\",\"-\",Rep_Data!R89))","v":"2 or Less"},null,null,null,null,null,null,null,null,null,null,null,null,null,{"$f":"Table1[[#This Row],[Speciality]]&Table1[[#This Row],[Q1]]","v":"GPYES"}]
[null,88,{"$f":"Rep_Data!A90","v":"FELICITA,  EVELIA"},{"$f":"Rep_Data!C90","v":"O66703"},{"$f":"Rep_Data!G90","v":"Salem"},{"$f":"Rep_Data!H90","v":"VA"},{"$f":"Rep_Data!I90","v":"24155"},{"$f":"Rep_Data!J90","v":"GP"},{"$f":"IF(Rep_Data!N90 = 0, \"-\",IF(Rep_Data!N90 = \"\",\"-\",Rep_Data!N90))","v":"-"},{"$f":"IF(Rep_Data!O90 = 0, \"-\",IF(Rep_Data!O90 = \"\",\"-\",Rep_Data!O90))","v":"-"},{"$f":"IF(Rep_Data!P90 = 0, \"-\",IF(Rep_Data!P90 = \"\",\"-\",Rep_Data!P90))","v":"-"},{"$f":"IF(Rep_Data!Q90 = 0, \"-\",IF(Rep_Data!Q90 = \"\",\"-\",Rep_Data!Q90))","v":"-"},{"$f":"IF(Rep_Data!R90 = 0, \"-\",IF(Rep_Data!R90 = \"\",\"-\",Rep_Data!R90))","v":"-"},null,null,null,null,null,null,null,null,null,null,null,null,null,{"$f":"Table1[[#This Row],[Speciality]]&Table1[[#This Row],[Q1]]","v":"GP-"}]
[null,89,{"$f":"Rep_Data!A91","v":"FILIBERTO,  SPARKLE"},{"$f":"Rep_Data!C91","v":"O66037"},{"$f":"Rep_Data!G91","v":"El Toro"},{"$f":"Rep_Data!H91","v":"CA"},{"$f":"Rep_Data!I91","v":"92609"},{"$f":"Rep_Data!J91","v":"Ortho"},{"$f":"IF(Rep_Data!N91 = 0, \"-\",IF(Rep_Data!N91 = \"\",\"-\",Rep_Data!N91))","v":"-"},{"$f":"IF(Rep_Data!O91 = 0, \"-\",IF(Rep_Data!O91 = \"\",\"-\",Rep_Data!O91))","v":"-"},{"$f":"IF(Rep_Data!P91 = 0, \"-\",IF(Rep_Data!P91 = \"\",\"-\",Rep_Data!P91))","v":"-"},{"$f":"IF(Rep_Data!Q91 = 0, \"-\",IF(Rep_Data!Q91 = \"\",\"-\",Rep_Data!Q91))","v":"-"},{"$f":"IF(Rep_Data!R91 = 0, \"-\",IF(Rep_Data!R91 = \"\",\"-\",Rep_Data!R91))","v":"-"},null,null,null,null,null,null,null,null,null,null,null,null,null,{"$f":"Table1[[#This Row],[Speciality]]&Table1[[#This Row],[Q1]]","v":"Ortho-"}]
[null,90,{"$f":"Rep_Data!A92","v":"FLETA,  LASHELL"},{"$f":"Rep_Data!C92","v":"O66816"},{"$f":"Rep_Data!G92","v":"Brookfield"},{"$f":"Rep_Data!H92","v":"CT"},{"$f":"Rep_Data!I92","v":"06804"},{"$f":"Rep_Data!J92","v":"GP"},{"$f":"IF(Rep_Data!N92 = 0, \"-\",IF(Rep_Data!N92 = \"\",\"-\",Rep_Data!N92))","v":"-"},{"$f":"IF(Rep_Data!O92 = 0, \"-\",IF(Rep_Data!O92 = \"\",\"-\",Rep_Data!O92))","v":"-"},{"$f":"IF(Rep_Data!P92 = 0, \"-\",IF(Rep_Data!P92 = \"\",\"-\",Rep_Data!P92))","v":"-"},{"$f":"IF(Rep_Data!Q92 = 0, \"-\",IF(Rep_Data!Q92 = \"\",\"-\",Rep_Data!Q92))","v":"-"},{"$f":"IF(Rep_Data!R92 = 0, \"-\",IF(Rep_Data!R92 = \"\",\"-\",Rep_Data!R92))","v":"-"},null,null,null,null,null,null,null,null,null,null,null,null,null,{"$f":"Table1[[#This Row],[Speciality]]&Table1[[#This Row],[Q1]]","v":"GP-"}]
[null,91,{"$f":"Rep_Data!A93","v":"FLORENTINO,  SHELTON"},{"$f":"Rep_Data!C93","v":"O61123"},{"$f":"Rep_Data!G93","v":"Fresno"},{"$f":"Rep_Data!H93","v":"CA"},{"$f":"Rep_Data!I93","v":"93844"},{"$f":"Rep_Data!J93","v":"GP"},{"$f":"IF(Rep_Data!N93 = 0, \"-\",IF(Rep_Data!N93 = \"\",\"-\",Rep_Data!N93))","v":"-"},{"$f":"IF(Rep_Data!O93 = 0, \"-\",IF(Rep_Data!O93 = \"\",\"-\",Rep_Data!O93))","v":"-"},{"$f":"IF(Rep_Data!P93 = 0, \"-\",IF(Rep_Data!P93 = \"\",\"-\",Rep_Data!P93))","v":"-"},{"$f":"IF(Rep_Data!Q93 = 0, \"-\",IF(Rep_Data!Q93 = \"\",\"-\",Rep_Data!Q93))","v":"-"},{"$f":"IF(Rep_Data!R93 = 0, \"-\",IF(Rep_Data!R93 = \"\",\"-\",Rep_Data!R93))","v":"-"},null,null,null,null,null,null,null,null,null,null,null,null,null,{"$f":"Table1[[#This Row],[Speciality]]&Table1[[#This Row],[Q1]]","v":"GP-"}]
[null,92,{"$f":"Rep_Data!A94","v":"FRANCINA,  VIVIAN"},{"$f":"Rep_Data!C94","v":"O65644"},{"$f":"Rep_Data!G94","v":"Henry"},{"$f":"Rep_Data!H94","v":"TN"},{"$f":"Rep_Data!I94","v":"38231"},{"$f":"Rep_Data!J94","v":"Ortho"},{"$f":"IF(Rep_Data!N94 = 0, \"-\",IF(Rep_Data!N94 = \"\",\"-\",Rep_Data!N94))","v":"-"},{"$f":"IF(Rep_Data!O94 = 0, \"-\",IF(Rep_Data!O94 = \"\",\"-\",Rep_Data!O94))","v":"-"},{"$f":"IF(Rep_Data!P94 = 0, \"-\",IF(Rep_Data!P94 = \"\",\"-\",Rep_Data!P94))","v":"-"},{"$f":"IF(Rep_Data!Q94 = 0, \"-\",IF(Rep_Data!Q94 = \"\",\"-\",Rep_Data!Q94))","v":"-"},{"$f":"IF(Rep_Data!R94 = 0, \"-\",IF(Rep_Data!R94 = \"\",\"-\",Rep_Data!R94))","v":"-"},null,null,null,null,null,null,null,null,null,null,null,null,null,{"$f":"Table1[[#This Row],[Speciality]]&Table1[[#This Row],[Q1]]","v":"Ortho-"}]
[null,93,{"$f":"Rep_Data!A95","v":"FRANCISCA,  AUREA"},{"$f":"Rep_Data!C95","v":"O77161"},{"$f":"Rep_Data!G95","v":"Bon Aqua"},{"$f":"Rep_Data!H95","v":"TN"},{"$f":"Rep_Data!I95","v":"37025"},{"$f":"Rep_Data!J95","v":"GP"},{"$f":"IF(Rep_Data!N95 = 0, \"-\",IF(Rep_Data!N95 = \"\",\"-\",Rep_Data!N95))","v":"YES"},{"$f":"IF(Rep_Data!O95 = 0, \"-\",IF(Rep_Data!O95 = \"\",\"-\",Rep_Data!O95))","v":"1 - 2"},{"$f":"IF(Rep_Data!P95 = 0, \"-\",IF(Rep_Data!P95 = \"\",\"-\",Rep_Data!P95))","v":"NONE"},{"$f":"IF(Rep_Data!Q95 = 0, \"-\",IF(Rep_Data!Q95 = \"\",\"-\",Rep_Data!Q95))","v":"1"},{"$f":"IF(Rep_Data!R95 = 0, \"-\",IF(Rep_Data!R95 = \"\",\"-\",Rep_Data!R95))","v":"2 or Less"},null,null,null,null,null,null,null,null,null,null,null,null,null,{"$f":"Table1[[#This Row],[Speciality]]&Table1[[#This Row],[Q1]]","v":"GPYES"}]
[null,94,{"$f":"Rep_Data!A96","v":"GEOFFREY,  CLARENCE"},{"$f":"Rep_Data!C96","v":"O63883"},{"$f":"Rep_Data!G96","v":"Barwick"},{"$f":"Rep_Data!H96","v":"GA"},{"$f":"Rep_Data!I96","v":"31720"},{"$f":"Rep_Data!J96","v":"Surgery"},{"$f":"IF(Rep_Data!N96 = 0, \"-\",IF(Rep_Data!N96 = \"\",\"-\",Rep_Data!N96))","v":"-"},{"$f":"IF(Rep_Data!O96 = 0, \"-\",IF(Rep_Data!O96 = \"\",\"-\",Rep_Data!O96))","v":"-"},{"$f":"IF(Rep_Data!P96 = 0, \"-\",IF(Rep_Data!P96 = \"\",\"-\",Rep_Data!P96))","v":"-"},{"$f":"IF(Rep_Data!Q96 = 0, \"-\",IF(Rep_Data!Q96 = \"\",\"-\",Rep_Data!Q96))","v":"-"},{"$f":"IF(Rep_Data!R96 = 0, \"-\",IF(Rep_Data!R96 = \"\",\"-\",Rep_Data!R96))","v":"-"},null,null,null,null,null,null,null,null,null,null,null,null,null,{"$f":"Table1[[#This Row],[Speciality]]&Table1[[#This Row],[Q1]]","v":"Surgery-"}]
[null,95,{"$f":"Rep_Data!A97","v":"GEORGE,  THANH"},{"$f":"Rep_Data!C97","v":"O65853"},{"$f":"Rep_Data!G97","v":"Seville"},{"$f":"Rep_Data!H97","v":"OH"},{"$f":"Rep_Data!I97","v":"44273"},{"$f":"Rep_Data!J97","v":"GP"},{"$f":"IF(Rep_Data!N97 = 0, \"-\",IF(Rep_Data!N97 = \"\",\"-\",Rep_Data!N97))","v":"-"},{"$f":"IF(Rep_Data!O97 = 0, \"-\",IF(Rep_Data!O97 = \"\",\"-\",Rep_Data!O97))","v":"-"},{"$f":"IF(Rep_Data!P97 = 0, \"-\",IF(Rep_Data!P97 = \"\",\"-\",Rep_Data!P97))","v":"-"},{"$f":"IF(Rep_Data!Q97 = 0, \"-\",IF(Rep_Data!Q97 = \"\",\"-\",Rep_Data!Q97))","v":"-"},{"$f":"IF(Rep_Data!R97 = 0, \"-\",IF(Rep_Data!R97 = \"\",\"-\",Rep_Data!R97))","v":"-"},null,null,null,null,null,null,null,null,null,null,null,null,null,{"$f":"Table1[[#This Row],[Speciality]]&Table1[[#This Row],[Q1]]","v":"GP-"}]
[null,96,{"$f":"Rep_Data!A98","v":"GRISELDA,  PEDRO"},{"$f":"Rep_Data!C98","v":"O53759"},{"$f":"Rep_Data!G98","v":"Dousman"},{"$f":"Rep_Data!H98","v":"WI"},{"$f":"Rep_Data!I98","v":"53118"},{"$f":"Rep_Data!J98","v":"GP"},{"$f":"IF(Rep_Data!N98 = 0, \"-\",IF(Rep_Data!N98 = \"\",\"-\",Rep_Data!N98))","v":"-"},{"$f":"IF(Rep_Data!O98 = 0, \"-\",IF(Rep_Data!O98 = \"\",\"-\",Rep_Data!O98))","v":"-"},{"$f":"IF(Rep_Data!P98 = 0, \"-\",IF(Rep_Data!P98 = \"\",\"-\",Rep_Data!P98))","v":"-"},{"$f":"IF(Rep_Data!Q98 = 0, \"-\",IF(Rep_Data!Q98 = \"\",\"-\",Rep_Data!Q98))","v":"-"},{"$f":"IF(Rep_Data!R98 = 0, \"-\",IF(Rep_Data!R98 = \"\",\"-\",Rep_Data!R98))","v":"-"},null,null,null,null,null,null,null,null,null,null,null,null,null,{"$f":"Table1[[#This Row],[Speciality]]&Table1[[#This Row],[Q1]]","v":"GP-"}]
[null,97,{"$f":"Rep_Data!A99","v":"HANNA,  KARL"},{"$f":"Rep_Data!C99","v":"O76044"},{"$f":"Rep_Data!G99","v":"Pueblo"},{"$f":"Rep_Data!H99","v":"CO"},{"$f":"Rep_Data!I99","v":"81002"},{"$f":"Rep_Data!J99","v":"Ortho"},{"$f":"IF(Rep_Data!N99 = 0, \"-\",IF(Rep_Data!N99 = \"\",\"-\",Rep_Data!N99))","v":"-"},{"$f":"IF(Rep_Data!O99 = 0, \"-\",IF(Rep_Data!O99 = \"\",\"-\",Rep_Data!O99))","v":"-"},{"$f":"IF(Rep_Data!P99 = 0, \"-\",IF(Rep_Data!P99 = \"\",\"-\",Rep_Data!P99))","v":"-"},{"$f":"IF(Rep_Data!Q99 = 0, \"-\",IF(Rep_Data!Q99 = \"\",\"-\",Rep_Data!Q99))","v":"-"},{"$f":"IF(Rep_Data!R99 = 0, \"-\",IF(Rep_Data!R99 = \"\",\"-\",Rep_Data!R99))","v":"-"},null,null,null,null,null,null,null,null,null,null,null,null,null,{"$f":"Table1[[#This Row],[Speciality]]&Table1[[#This Row],[Q1]]","v":"Ortho-"}]
[null,98,{"$f":"Rep_Data!A100","v":"HANS,  ANNETT"},{"$f":"Rep_Data!C100","v":"O63503"},{"$f":"Rep_Data!G100","v":"Newport"},{"$f":"Rep_Data!H100","v":"VT"},{"$f":"Rep_Data!I100","v":"05855"},{"$f":"Rep_Data!J100","v":"Surgery"},{"$f":"IF(Rep_Data!N100 = 0, \"-\",IF(Rep_Data!N100 = \"\",\"-\",Rep_Data!N100))","v":"-"},{"$f":"IF(Rep_Data!O100 = 0, \"-\",IF(Rep_Data!O100 = \"\",\"-\",Rep_Data!O100))","v":"-"},{"$f":"IF(Rep_Data!P100 = 0, \"-\",IF(Rep_Data!P100 = \"\",\"-\",Rep_Data!P100))","v":"-"},{"$f":"IF(Rep_Data!Q100 = 0, \"-\",IF(Rep_Data!Q100 = \"\",\"-\",Rep_Data!Q100))","v":"-"},{"$f":"IF(Rep_Data!R100 = 0, \"-\",IF(Rep_Data!R100 = \"\",\"-\",Rep_Data!R100))","v":"-"},null,null,null,null,null,null,null,null,null,null,null,null,null,{"$f":"Table1[[#This Row],[Speciality]]&Table1[[#This Row],[Q1]]","v":"Surgery-"}]
[null,99,{"$f":"Rep_Data!A101","v":"HELEN,  BLYTHE"},{"$f":"Rep_Data!C101","v":"O59649"},{"$f":"Rep_Data!G101","v":"Latah"},{"$f":"Rep_Data!H101","v":"WA"},{"$f":"Rep_Data!I101","v":"99018"},{"$f":"Rep_Data!J101","v":"Ortho"},{"$f":"IF(Rep_Data!N101 = 0, \"-\",IF(Rep_Data!N101 = \"\",\"-\",Rep_Data!N101))","v":"-"},{"$f":"IF(Rep_Data!O101 = 0, \"-\",IF(Rep_Data!O101 = \"\",\"-\",Rep_Data!O101))","v":"-"},{"$f":"IF(Rep_Data!P101 = 0, \"-\",IF(Rep_Data!P101 = \"\",\"-\",Rep_Data!P101))","v":"-"},{"$f":"IF(Rep_Data!Q101 = 0, \"-\",IF(Rep_Data!Q101 = \"\",\"-\",Rep_Data!Q101))","v":"-"},{"$f":"IF(Rep_Data!R101 = 0, \"-\",IF(Rep_Data!R101 = \"\",\"-\",Rep_Data!R101))","v":"-"},null,null,null,null,null,null,null,null,null,null,null,null,null,{"$f":"Table1[[#This Row],[Speciality]]&Table1[[#This Row],[Q1]]","v":"Ortho-"}]
[null,100,{"$f":"Rep_Data!A102","v":"HOLLIS,  CARMELO"},{"$f":"Rep_Data!C102","v":"O76740"},{"$f":"Rep_Data!G102","v":"Kennard"},{"$f":"Rep_Data!H102","v":"IN"},{"$f":"Rep_Data!I102","v":"47351"},{"$f":"Rep_Data!J102","v":"GP"},{"$f":"IF(Rep_Data!N102 = 0, \"-\",IF(Rep_Data!N102 = \"\",\"-\",Rep_Data!N102))","v":"YES"},{"$f":"IF(Rep_Data!O102 = 0, \"-\",IF(Rep_Data!O102 = \"\",\"-\",Rep_Data!O102))","v":"3 - 4"},{"$f":"IF(Rep_Data!P102 = 0, \"-\",IF(Rep_Data!P102 = \"\",\"-\",Rep_Data!P102))","v":"1 - 3"},{"$f":"IF(Rep_Data!Q102 = 0, \"-\",IF(Rep_Data!Q102 = \"\",\"-\",Rep_Data!Q102))","v":"2 - 3"},{"$f":"IF(Rep_Data!R102 = 0, \"-\",IF(Rep_Data!R102 = \"\",\"-\",Rep_Data!R102))","v":"More than 2"},null,null,null,null,null,null,null,null,null,null,null,null,null,{"$f":"Table1[[#This Row],[Speciality]]&Table1[[#This Row],[Q1]]","v":"GPYES"}]
[null,101,{"$f":"Rep_Data!A103","v":"HOSEA,  DACIA"},{"$f":"Rep_Data!C103","v":"O50471"},{"$f":"Rep_Data!G103","v":"Inverness"},{"$f":"Rep_Data!H103","v":"FL"},{"$f":"Rep_Data!I103","v":"34451"},{"$f":"Rep_Data!J103","v":"Surgery"},{"$f":"IF(Rep_Data!N103 = 0, \"-\",IF(Rep_Data!N103 = \"\",\"-\",Rep_Data!N103))","v":"YES"},{"$f":"IF(Rep_Data!O103 = 0, \"-\",IF(Rep_Data!O103 = \"\",\"-\",Rep_Data!O103))","v":"1 - 2"},{"$f":"IF(Rep_Data!P103 = 0, \"-\",IF(Rep_Data!P103 = \"\",\"-\",Rep_Data!P103))","v":"NONE"},{"$f":"IF(Rep_Data!Q103 = 0, \"-\",IF(Rep_Data!Q103 = \"\",\"-\",Rep_Data!Q103))","v":"1"},{"$f":"IF(Rep_Data!R103 = 0, \"-\",IF(Rep_Data!R103 = \"\",\"-\",Rep_Data!R103))","v":"2 or Less"},null,null,null,null,null,null,null,null,null,null,null,null,null,{"$f":"Table1[[#This Row],[Speciality]]&Table1[[#This Row],[Q1]]","v":"SurgeryYES"}]
[null,102,{"$f":"Rep_Data!A104","v":"IDALIA,  DORATHY"},{"$f":"Rep_Data!C104","v":"O65264"},{"$f":"Rep_Data!G104","v":"Venetia"},{"$f":"Rep_Data!H104","v":"PA"},{"$f":"Rep_Data!I104","v":"15367"},{"$f":"Rep_Data!J104","v":"GP"},{"$f":"IF(Rep_Data!N104 = 0, \"-\",IF(Rep_Data!N104 = \"\",\"-\",Rep_Data!N104))","v":"-"},{"$f":"IF(Rep_Data!O104 = 0, \"-\",IF(Rep_Data!O104 = \"\",\"-\",Rep_Data!O104))","v":"-"},{"$f":"IF(Rep_Data!P104 = 0, \"-\",IF(Rep_Data!P104 = \"\",\"-\",Rep_Data!P104))","v":"-"},{"$f":"IF(Rep_Data!Q104 = 0, \"-\",IF(Rep_Data!Q104 = \"\",\"-\",Rep_Data!Q104))","v":"-"},{"$f":"IF(Rep_Data!R104 = 0, \"-\",IF(Rep_Data!R104 = \"\",\"-\",Rep_Data!R104))","v":"-"},null,null,null,null,null,null,null,null,null,null,null,null,null,{"$f":"Table1[[#This Row],[Speciality]]&Table1[[#This Row],[Q1]]","v":"GP-"}]
[null,103,{"$f":"Rep_Data!A105","v":"INEZ,  SHAWNEE"},{"$f":"Rep_Data!C105","v":"O78661"},{"$f":"Rep_Data!G105","v":"Marthasville"},{"$f":"Rep_Data!H105","v":"MO"},{"$f":"Rep_Data!I105","v":"63357"},{"$f":"Rep_Data!J105","v":"Surgery"},{"$f":"IF(Rep_Data!N105 = 0, \"-\",IF(Rep_Data!N105 = \"\",\"-\",Rep_Data!N105))","v":"-"},{"$f":"IF(Rep_Data!O105 = 0, \"-\",IF(Rep_Data!O105 = \"\",\"-\",Rep_Data!O105))","v":"-"},{"$f":"IF(Rep_Data!P105 = 0, \"-\",IF(Rep_Data!P105 = \"\",\"-\",Rep_Data!P105))","v":"-"},{"$f":"IF(Rep_Data!Q105 = 0, \"-\",IF(Rep_Data!Q105 = \"\",\"-\",Rep_Data!Q105))","v":"-"},{"$f":"IF(Rep_Data!R105 = 0, \"-\",IF(Rep_Data!R105 = \"\",\"-\",Rep_Data!R105))","v":"-"},null,null,null,null,null,null,null,null,null,null,null,null,null,{"$f":"Table1[[#This Row],[Speciality]]&Table1[[#This Row],[Q1]]","v":"Surgery-"}]
[null,104,{"$f":"Rep_Data!A106","v":"IRAIDA,  HYUN"},{"$f":"Rep_Data!C106","v":"O63145"},{"$f":"Rep_Data!G106","v":"North Las Vegas"},{"$f":"Rep_Data!H106","v":"NV"},{"$f":"Rep_Data!I106","v":"89031"},{"$f":"Rep_Data!J106","v":"GP"},{"$f":"IF(Rep_Data!N106 = 0, \"-\",IF(Rep_Data!N106 = \"\",\"-\",Rep_Data!N106))","v":"-"},{"$f":"IF(Rep_Data!O106 = 0, \"-\",IF(Rep_Data!O106 = \"\",\"-\",Rep_Data!O106))","v":"-"},{"$f":"IF(Rep_Data!P106 = 0, \"-\",IF(Rep_Data!P106 = \"\",\"-\",Rep_Data!P106))","v":"-"},{"$f":"IF(Rep_Data!Q106 = 0, \"-\",IF(Rep_Data!Q106 = \"\",\"-\",Rep_Data!Q106))","v":"-"},{"$f":"IF(Rep_Data!R106 = 0, \"-\",IF(Rep_Data!R106 = \"\",\"-\",Rep_Data!R106))","v":"-"},null,null,null,null,null,null,null,null,null,null,null,null,null,{"$f":"Table1[[#This Row],[Speciality]]&Table1[[#This Row],[Q1]]","v":"GP-"}]
[null,105,{"$f":"Rep_Data!A107","v":"ISAIAS,  LIANNE"},{"$f":"Rep_Data!C107","v":"O63702"},{"$f":"Rep_Data!G107","v":"Shaktoolik"},{"$f":"Rep_Data!H107","v":"AK"},{"$f":"Rep_Data!I107","v":"99771"},{"$f":"Rep_Data!J107","v":"GP"},{"$f":"IF(Rep_Data!N107 = 0, \"-\",IF(Rep_Data!N107 = \"\",\"-\",Rep_Data!N107))","v":"-"},{"$f":"IF(Rep_Data!O107 = 0, \"-\",IF(Rep_Data!O107 = \"\",\"-\",Rep_Data!O107))","v":"-"},{"$f":"IF(Rep_Data!P107 = 0, \"-\",IF(Rep_Data!P107 = \"\",\"-\",Rep_Data!P107))","v":"-"},{"$f":"IF(Rep_Data!Q107 = 0, \"-\",IF(Rep_Data!Q107 = \"\",\"-\",Rep_Data!Q107))","v":"-"},{"$f":"IF(Rep_Data!R107 = 0, \"-\",IF(Rep_Data!R107 = \"\",\"-\",Rep_Data!R107))","v":"-"},null,null,null,null,null,null,null,null,null,null,null,null,null,{"$f":"Table1[[#This Row],[Speciality]]&Table1[[#This Row],[Q1]]","v":"GP-"}]
[null,106,{"$f":"Rep_Data!A108","v":"ISELA,  ERIN"},{"$f":"Rep_Data!C108","v":"O78326"},{"$f":"Rep_Data!G108","v":"Holtsville"},{"$f":"Rep_Data!H108","v":"NY"},{"$f":"Rep_Data!I108","v":"00501"},{"$f":"Rep_Data!J108","v":"GP"},{"$f":"IF(Rep_Data!N108 = 0, \"-\",IF(Rep_Data!N108 = \"\",\"-\",Rep_Data!N108))","v":"-"},{"$f":"IF(Rep_Data!O108 = 0, \"-\",IF(Rep_Data!O108 = \"\",\"-\",Rep_Data!O108))","v":"-"},{"$f":"IF(Rep_Data!P108 = 0, \"-\",IF(Rep_Data!P108 = \"\",\"-\",Rep_Data!P108))","v":"-"},{"$f":"IF(Rep_Data!Q108 = 0, \"-\",IF(Rep_Data!Q108 = \"\",\"-\",Rep_Data!Q108))","v":"-"},{"$f":"IF(Rep_Data!R108 = 0, \"-\",IF(Rep_Data!R108 = \"\",\"-\",Rep_Data!R108))","v":"-"},null,null,null,null,null,null,null,null,null,null,null,null,null,{"$f":"Table1[[#This Row],[Speciality]]&Table1[[#This Row],[Q1]]","v":"GP-"}]
[null,107,{"$f":"Rep_Data!A109","v":"JANET,  EVETTE"},{"$f":"Rep_Data!C109","v":"O72326"},{"$f":"Rep_Data!G109","v":"Gladstone"},{"$f":"Rep_Data!H109","v":"ND"},{"$f":"Rep_Data!I109","v":"58630"},{"$f":"Rep_Data!J109","v":"GP"},{"$f":"IF(Rep_Data!N109 = 0, \"-\",IF(Rep_Data!N109 = \"\",\"-\",Rep_Data!N109))","v":"-"},{"$f":"IF(Rep_Data!O109 = 0, \"-\",IF(Rep_Data!O109 = \"\",\"-\",Rep_Data!O109))","v":"-"},{"$f":"IF(Rep_Data!P109 = 0, \"-\",IF(Rep_Data!P109 = \"\",\"-\",Rep_Data!P109))","v":"-"},{"$f":"IF(Rep_Data!Q109 = 0, \"-\",IF(Rep_Data!Q109 = \"\",\"-\",Rep_Data!Q109))","v":"-"},{"$f":"IF(Rep_Data!R109 = 0, \"-\",IF(Rep_Data!R109 = \"\",\"-\",Rep_Data!R109))","v":"-"},null,null,null,null,null,null,null,null,null,null,null,null,null,{"$f":"Table1[[#This Row],[Speciality]]&Table1[[#This Row],[Q1]]","v":"GP-"}]
[null,108,{"$f":"Rep_Data!A110","v":"JANICE,  SOFIA"},{"$f":"Rep_Data!C110","v":"O56588"},{"$f":"Rep_Data!G110","v":"Greensboro"},{"$f":"Rep_Data!H110","v":"NC"},{"$f":"Rep_Data!I110","v":"27407"},{"$f":"Rep_Data!J110","v":"GP"},{"$f":"IF(Rep_Data!N110 = 0, \"-\",IF(Rep_Data!N110 = \"\",\"-\",Rep_Data!N110))","v":"YES"},{"$f":"IF(Rep_Data!O110 = 0, \"-\",IF(Rep_Data!O110 = \"\",\"-\",Rep_Data!O110))","v":"3 - 4"},{"$f":"IF(Rep_Data!P110 = 0, \"-\",IF(Rep_Data!P110 = \"\",\"-\",Rep_Data!P110))","v":"1 - 3"},{"$f":"IF(Rep_Data!Q110 = 0, \"-\",IF(Rep_Data!Q110 = \"\",\"-\",Rep_Data!Q110))","v":"2 - 3"},{"$f":"IF(Rep_Data!R110 = 0, \"-\",IF(Rep_Data!R110 = \"\",\"-\",Rep_Data!R110))","v":"More than 2"},null,null,null,null,null,null,null,null,null,null,null,null,null,{"$f":"Table1[[#This Row],[Speciality]]&Table1[[#This Row],[Q1]]","v":"GPYES"}]
[null,109,{"$f":"Rep_Data!A111","v":"JANNETTE,  MARYBELLE"},{"$f":"Rep_Data!C111","v":"O56098"},{"$f":"Rep_Data!G111","v":"Lake Ann"},{"$f":"Rep_Data!H111","v":"MI"},{"$f":"Rep_Data!I111","v":"49650"},{"$f":"Rep_Data!J111","v":"GP"},{"$f":"IF(Rep_Data!N111 = 0, \"-\",IF(Rep_Data!N111 = \"\",\"-\",Rep_Data!N111))","v":"-"},{"$f":"IF(Rep_Data!O111 = 0, \"-\",IF(Rep_Data!O111 = \"\",\"-\",Rep_Data!O111))","v":"-"},{"$f":"IF(Rep_Data!P111 = 0, \"-\",IF(Rep_Data!P111 = \"\",\"-\",Rep_Data!P111))","v":"-"},{"$f":"IF(Rep_Data!Q111 = 0, \"-\",IF(Rep_Data!Q111 = \"\",\"-\",Rep_Data!Q111))","v":"-"},{"$f":"IF(Rep_Data!R111 = 0, \"-\",IF(Rep_Data!R111 = \"\",\"-\",Rep_Data!R111))","v":"-"},null,null,null,null,null,null,null,null,null,null,null,null,null,{"$f":"Table1[[#This Row],[Speciality]]&Table1[[#This Row],[Q1]]","v":"GP-"}]
[null,110,{"$f":"Rep_Data!A112","v":"JENICE,  NAKESHA"},{"$f":"Rep_Data!C112","v":"O56948"},{"$f":"Rep_Data!G112","v":"Manomet"},{"$f":"Rep_Data!H112","v":"MA"},{"$f":"Rep_Data!I112","v":"02345"},{"$f":"Rep_Data!J112","v":"GP"},{"$f":"IF(Rep_Data!N112 = 0, \"-\",IF(Rep_Data!N112 = \"\",\"-\",Rep_Data!N112))","v":"YES"},{"$f":"IF(Rep_Data!O112 = 0, \"-\",IF(Rep_Data!O112 = \"\",\"-\",Rep_Data!O112))","v":"1 - 2"},{"$f":"IF(Rep_Data!P112 = 0, \"-\",IF(Rep_Data!P112 = \"\",\"-\",Rep_Data!P112))","v":"NONE"},{"$f":"IF(Rep_Data!Q112 = 0, \"-\",IF(Rep_Data!Q112 = \"\",\"-\",Rep_Data!Q112))","v":"1"},{"$f":"IF(Rep_Data!R112 = 0, \"-\",IF(Rep_Data!R112 = \"\",\"-\",Rep_Data!R112))","v":"2 or Less"},null,null,null,null,null,null,null,null,null,null,null,null,null,{"$f":"Table1[[#This Row],[Speciality]]&Table1[[#This Row],[Q1]]","v":"GPYES"}]
[null,111,{"$f":"Rep_Data!A113","v":"JENNI,  ARNETTE"},{"$f":"Rep_Data!C113","v":"O71795"},{"$f":"Rep_Data!G113","v":"Niagara Falls"},{"$f":"Rep_Data!H113","v":"NY"},{"$f":"Rep_Data!I113","v":"14303"},{"$f":"Rep_Data!J113","v":"GP"},{"$f":"IF(Rep_Data!N113 = 0, \"-\",IF(Rep_Data!N113 = \"\",\"-\",Rep_Data!N113))","v":"-"},{"$f":"IF(Rep_Data!O113 = 0, \"-\",IF(Rep_Data!O113 = \"\",\"-\",Rep_Data!O113))","v":"-"},{"$f":"IF(Rep_Data!P113 = 0, \"-\",IF(Rep_Data!P113 = \"\",\"-\",Rep_Data!P113))","v":"-"},{"$f":"IF(Rep_Data!Q113 = 0, \"-\",IF(Rep_Data!Q113 = \"\",\"-\",Rep_Data!Q113))","v":"-"},{"$f":"IF(Rep_Data!R113 = 0, \"-\",IF(Rep_Data!R113 = \"\",\"-\",Rep_Data!R113))","v":"-"},null,null,null,null,null,null,null,null,null,null,null,null,null,{"$f":"Table1[[#This Row],[Speciality]]&Table1[[#This Row],[Q1]]","v":"GP-"}]
[null,112,{"$f":"Rep_Data!A114","v":"JERALDINE,  JEANNA"},{"$f":"Rep_Data!C114","v":"O58134"},{"$f":"Rep_Data!G114","v":"Pukwana"},{"$f":"Rep_Data!H114","v":"SD"},{"$f":"Rep_Data!I114","v":"57370"},{"$f":"Rep_Data!J114","v":"GP"},{"$f":"IF(Rep_Data!N114 = 0, \"-\",IF(Rep_Data!N114 = \"\",\"-\",Rep_Data!N114))","v":"YES"},{"$f":"IF(Rep_Data!O114 = 0, \"-\",IF(Rep_Data!O114 = \"\",\"-\",Rep_Data!O114))","v":"1 - 2"},{"$f":"IF(Rep_Data!P114 = 0, \"-\",IF(Rep_Data!P114 = \"\",\"-\",Rep_Data!P114))","v":"NONE"},{"$f":"IF(Rep_Data!Q114 = 0, \"-\",IF(Rep_Data!Q114 = \"\",\"-\",Rep_Data!Q114))","v":"1"},{"$f":"IF(Rep_Data!R114 = 0, \"-\",IF(Rep_Data!R114 = \"\",\"-\",Rep_Data!R114))","v":"More than 2"},null,null,null,null,null,null,null,null,null,null,null,null,null,{"$f":"Table1[[#This Row],[Speciality]]&Table1[[#This Row],[Q1]]","v":"GPYES"}]
[null,113,{"$f":"Rep_Data!A115","v":"JOANNA,  REVA"},{"$f":"Rep_Data!C115","v":"O63775"},{"$f":"Rep_Data!G115","v":"Erath"},{"$f":"Rep_Data!H115","v":"LA"},{"$f":"Rep_Data!I115","v":"70533"},{"$f":"Rep_Data!J115","v":"Ortho"},{"$f":"IF(Rep_Data!N115 = 0, \"-\",IF(Rep_Data!N115 = \"\",\"-\",Rep_Data!N115))","v":"-"},{"$f":"IF(Rep_Data!O115 = 0, \"-\",IF(Rep_Data!O115 = \"\",\"-\",Rep_Data!O115))","v":"-"},{"$f":"IF(Rep_Data!P115 = 0, \"-\",IF(Rep_Data!P115 = \"\",\"-\",Rep_Data!P115))","v":"-"},{"$f":"IF(Rep_Data!Q115 = 0, \"-\",IF(Rep_Data!Q115 = \"\",\"-\",Rep_Data!Q115))","v":"-"},{"$f":"IF(Rep_Data!R115 = 0, \"-\",IF(Rep_Data!R115 = \"\",\"-\",Rep_Data!R115))","v":"-"},null,null,null,null,null,null,null,null,null,null,null,null,null,{"$f":"Table1[[#This Row],[Speciality]]&Table1[[#This Row],[Q1]]","v":"Ortho-"}]
[null,114,{"$f":"Rep_Data!A116","v":"JOEL,  HOLLIS"},{"$f":"Rep_Data!C116","v":"O63105"},{"$f":"Rep_Data!G116","v":"Maud"},{"$f":"Rep_Data!H116","v":"OK"},{"$f":"Rep_Data!I116","v":"74854"},{"$f":"Rep_Data!J116","v":"GP"},{"$f":"IF(Rep_Data!N116 = 0, \"-\",IF(Rep_Data!N116 = \"\",\"-\",Rep_Data!N116))","v":"-"},{"$f":"IF(Rep_Data!O116 = 0, \"-\",IF(Rep_Data!O116 = \"\",\"-\",Rep_Data!O116))","v":"-"},{"$f":"IF(Rep_Data!P116 = 0, \"-\",IF(Rep_Data!P116 = \"\",\"-\",Rep_Data!P116))","v":"-"},{"$f":"IF(Rep_Data!Q116 = 0, \"-\",IF(Rep_Data!Q116 = \"\",\"-\",Rep_Data!Q116))","v":"-"},{"$f":"IF(Rep_Data!R116 = 0, \"-\",IF(Rep_Data!R116 = \"\",\"-\",Rep_Data!R116))","v":"-"},null,null,null,null,null,null,null,null,null,null,null,null,null,{"$f":"Table1[[#This Row],[Speciality]]&Table1[[#This Row],[Q1]]","v":"GP-"}]
[null,115,{"$f":"Rep_Data!A117","v":"JOHNNY,  LASHAWN"},{"$f":"Rep_Data!C117","v":"O60773"},{"$f":"Rep_Data!G117","v":"Cusseta"},{"$f":"Rep_Data!H117","v":"AL"},{"$f":"Rep_Data!I117","v":"36852"},{"$f":"Rep_Data!J117","v":"GP"},{"$f":"IF(Rep_Data!N117 = 0, \"-\",IF(Rep_Data!N117 = \"\",\"-\",Rep_Data!N117))","v":"-"},{"$f":"IF(Rep_Data!O117 = 0, \"-\",IF(Rep_Data!O117 = \"\",\"-\",Rep_Data!O117))","v":"-"},{"$f":"IF(Rep_Data!P117 = 0, \"-\",IF(Rep_Data!P117 = \"\",\"-\",Rep_Data!P117))","v":"-"},{"$f":"IF(Rep_Data!Q117 = 0, \"-\",IF(Rep_Data!Q117 = \"\",\"-\",Rep_Data!Q117))","v":"-"},{"$f":"IF(Rep_Data!R117 = 0, \"-\",IF(Rep_Data!R117 = \"\",\"-\",Rep_Data!R117))","v":"-"},null,null,null,null,null,null,null,null,null,null,null,null,null,{"$f":"Table1[[#This Row],[Speciality]]&Table1[[#This Row],[Q1]]","v":"GP-"}]
[null,116,{"$f":"Rep_Data!A118","v":"JOSIE,  LAMONT"},{"$f":"Rep_Data!C118","v":"O59419"},{"$f":"Rep_Data!G118","v":"Hyde Park"},{"$f":"Rep_Data!H118","v":"PA"},{"$f":"Rep_Data!I118","v":"15641"},{"$f":"Rep_Data!J118","v":"Surgery"},{"$f":"IF(Rep_Data!N118 = 0, \"-\",IF(Rep_Data!N118 = \"\",\"-\",Rep_Data!N118))","v":"YES"},{"$f":"IF(Rep_Data!O118 = 0, \"-\",IF(Rep_Data!O118 = \"\",\"-\",Rep_Data!O118))","v":"1 - 2"},{"$f":"IF(Rep_Data!P118 = 0, \"-\",IF(Rep_Data!P118 = \"\",\"-\",Rep_Data!P118))","v":"NONE"},{"$f":"IF(Rep_Data!Q118 = 0, \"-\",IF(Rep_Data!Q118 = \"\",\"-\",Rep_Data!Q118))","v":"1"},{"$f":"IF(Rep_Data!R118 = 0, \"-\",IF(Rep_Data!R118 = \"\",\"-\",Rep_Data!R118))","v":"2 or Less"},null,null,null,null,null,null,null,null,null,null,null,null,null,{"$f":"Table1[[#This Row],[Speciality]]&Table1[[#This Row],[Q1]]","v":"SurgeryYES"}]
[null,117,{"$f":"Rep_Data!A119","v":"JOVITA,  ELISEO"},{"$f":"Rep_Data!C119","v":"O55890"},{"$f":"Rep_Data!G119","v":"Cross Plains"},{"$f":"Rep_Data!H119","v":"TN"},{"$f":"Rep_Data!I119","v":"37049"},{"$f":"Rep_Data!J119","v":"Surgery"},{"$f":"IF(Rep_Data!N119 = 0, \"-\",IF(Rep_Data!N119 = \"\",\"-\",Rep_Data!N119))","v":"-"},{"$f":"IF(Rep_Data!O119 = 0, \"-\",IF(Rep_Data!O119 = \"\",\"-\",Rep_Data!O119))","v":"-"},{"$f":"IF(Rep_Data!P119 = 0, \"-\",IF(Rep_Data!P119 = \"\",\"-\",Rep_Data!P119))","v":"-"},{"$f":"IF(Rep_Data!Q119 = 0, \"-\",IF(Rep_Data!Q119 = \"\",\"-\",Rep_Data!Q119))","v":"-"},{"$f":"IF(Rep_Data!R119 = 0, \"-\",IF(Rep_Data!R119 = \"\",\"-\",Rep_Data!R119))","v":"-"},null,null,null,null,null,null,null,null,null,null,null,null,null,{"$f":"Table1[[#This Row],[Speciality]]&Table1[[#This Row],[Q1]]","v":"Surgery-"}]
[null,118,{"$f":"Rep_Data!A120","v":"JULIE,  FAYE"},{"$f":"Rep_Data!C120","v":"O73801"},{"$f":"Rep_Data!G120","v":"Omaha"},{"$f":"Rep_Data!H120","v":"NE"},{"$f":"Rep_Data!I120","v":"68134"},{"$f":"Rep_Data!J120","v":"Ortho"},{"$f":"IF(Rep_Data!N120 = 0, \"-\",IF(Rep_Data!N120 = \"\",\"-\",Rep_Data!N120))","v":"YES"},{"$f":"IF(Rep_Data!O120 = 0, \"-\",IF(Rep_Data!O120 = \"\",\"-\",Rep_Data!O120))","v":"1 - 2"},{"$f":"IF(Rep_Data!P120 = 0, \"-\",IF(Rep_Data!P120 = \"\",\"-\",Rep_Data!P120))","v":"NONE"},{"$f":"IF(Rep_Data!Q120 = 0, \"-\",IF(Rep_Data!Q120 = \"\",\"-\",Rep_Data!Q120))","v":"1"},{"$f":"IF(Rep_Data!R120 = 0, \"-\",IF(Rep_Data!R120 = \"\",\"-\",Rep_Data!R120))","v":"2 or Less"},null,null,null,null,null,null,null,null,null,null,null,null,null,{"$f":"Table1[[#This Row],[Speciality]]&Table1[[#This Row],[Q1]]","v":"OrthoYES"}]
[null,119,{"$f":"Rep_Data!A121","v":"JUNG,  ADRIANA"},{"$f":"Rep_Data!C121","v":"O62057"},{"$f":"Rep_Data!G121","v":"Newark"},{"$f":"Rep_Data!H121","v":"TX"},{"$f":"Rep_Data!I121","v":"76071"},{"$f":"Rep_Data!J121","v":"GP"},{"$f":"IF(Rep_Data!N121 = 0, \"-\",IF(Rep_Data!N121 = \"\",\"-\",Rep_Data!N121))","v":"-"},{"$f":"IF(Rep_Data!O121 = 0, \"-\",IF(Rep_Data!O121 = \"\",\"-\",Rep_Data!O121))","v":"-"},{"$f":"IF(Rep_Data!P121 = 0, \"-\",IF(Rep_Data!P121 = \"\",\"-\",Rep_Data!P121))","v":"-"},{"$f":"IF(Rep_Data!Q121 = 0, \"-\",IF(Rep_Data!Q121 = \"\",\"-\",Rep_Data!Q121))","v":"-"},{"$f":"IF(Rep_Data!R121 = 0, \"-\",IF(Rep_Data!R121 = \"\",\"-\",Rep_Data!R121))","v":"-"},null,null,null,null,null,null,null,null,null,null,null,null,null,{"$f":"Table1[[#This Row],[Speciality]]&Table1[[#This Row],[Q1]]","v":"GP-"}]
[null,120,{"$f":"Rep_Data!A122","v":"KASANDRA,  WESLEY"},{"$f":"Rep_Data!C122","v":"O62917"},{"$f":"Rep_Data!G122","v":"Rockford"},{"$f":"Rep_Data!H122","v":"IL"},{"$f":"Rep_Data!I122","v":"61106"},{"$f":"Rep_Data!J122","v":"GP"},{"$f":"IF(Rep_Data!N122 = 0, \"-\",IF(Rep_Data!N122 = \"\",\"-\",Rep_Data!N122))","v":"-"},{"$f":"IF(Rep_Data!O122 = 0, \"-\",IF(Rep_Data!O122 = \"\",\"-\",Rep_Data!O122))","v":"-"},{"$f":"IF(Rep_Data!P122 = 0, \"-\",IF(Rep_Data!P122 = \"\",\"-\",Rep_Data!P122))","v":"-"},{"$f":"IF(Rep_Data!Q122 = 0, \"-\",IF(Rep_Data!Q122 = \"\",\"-\",Rep_Data!Q122))","v":"-"},{"$f":"IF(Rep_Data!R122 = 0, \"-\",IF(Rep_Data!R122 = \"\",\"-\",Rep_Data!R122))","v":"-"},null,null,null,null,null,null,null,null,null,null,null,null,null,{"$f":"Table1[[#This Row],[Speciality]]&Table1[[#This Row],[Q1]]","v":"GP-"}]
[null,121,{"$f":"Rep_Data!A123","v":"KATHLINE,  LAVERN"},{"$f":"Rep_Data!C123","v":"O64183"},{"$f":"Rep_Data!G123","v":"Shrewsbury"},{"$f":"Rep_Data!H123","v":"NJ"},{"$f":"Rep_Data!I123","v":"07702"},{"$f":"Rep_Data!J123","v":"GP"},{"$f":"IF(Rep_Data!N123 = 0, \"-\",IF(Rep_Data!N123 = \"\",\"-\",Rep_Data!N123))","v":"-"},{"$f":"IF(Rep_Data!O123 = 0, \"-\",IF(Rep_Data!O123 = \"\",\"-\",Rep_Data!O123))","v":"-"},{"$f":"IF(Rep_Data!P123 = 0, \"-\",IF(Rep_Data!P123 = \"\",\"-\",Rep_Data!P123))","v":"-"},{"$f":"IF(Rep_Data!Q123 = 0, \"-\",IF(Rep_Data!Q123 = \"\",\"-\",Rep_Data!Q123))","v":"-"},{"$f":"IF(Rep_Data!R123 = 0, \"-\",IF(Rep_Data!R123 = \"\",\"-\",Rep_Data!R123))","v":"-"},null,null,null,null,null,null,null,null,null,null,null,null,null,{"$f":"Table1[[#This Row],[Speciality]]&Table1[[#This Row],[Q1]]","v":"GP-"}]
[null,122,{"$f":"Rep_Data!A124","v":"KATHRINE,  TAMELA"},{"$f":"Rep_Data!C124","v":"O52456"},{"$f":"Rep_Data!G124","v":"Spencer"},{"$f":"Rep_Data!H124","v":"OH"},{"$f":"Rep_Data!I124","v":"44275"},{"$f":"Rep_Data!J124","v":"GP"},{"$f":"IF(Rep_Data!N124 = 0, \"-\",IF(Rep_Data!N124 = \"\",\"-\",Rep_Data!N124))","v":"-"},{"$f":"IF(Rep_Data!O124 = 0, \"-\",IF(Rep_Data!O124 = \"\",\"-\",Rep_Data!O124))","v":"-"},{"$f":"IF(Rep_Data!P124 = 0, \"-\",IF(Rep_Data!P124 = \"\",\"-\",Rep_Data!P124))","v":"-"},{"$f":"IF(Rep_Data!Q124 = 0, \"-\",IF(Rep_Data!Q124 = \"\",\"-\",Rep_Data!Q124))","v":"-"},{"$f":"IF(Rep_Data!R124 = 0, \"-\",IF(Rep_Data!R124 = \"\",\"-\",Rep_Data!R124))","v":"-"},null,null,null,null,null,null,null,null,null,null,null,null,null,{"$f":"Table1[[#This Row],[Speciality]]&Table1[[#This Row],[Q1]]","v":"GP-"}]
[null,123,{"$f":"Rep_Data!A125","v":"KATHRYN,  CRISTIE"},{"$f":"Rep_Data!C125","v":"O69889"},{"$f":"Rep_Data!G125","v":"Canastota"},{"$f":"Rep_Data!H125","v":"NY"},{"$f":"Rep_Data!I125","v":"13032"},{"$f":"Rep_Data!J125","v":"GP"},{"$f":"IF(Rep_Data!N125 = 0, \"-\",IF(Rep_Data!N125 = \"\",\"-\",Rep_Data!N125))","v":"-"},{"$f":"IF(Rep_Data!O125 = 0, \"-\",IF(Rep_Data!O125 = \"\",\"-\",Rep_Data!O125))","v":"-"},{"$f":"IF(Rep_Data!P125 = 0, \"-\",IF(Rep_Data!P125 = \"\",\"-\",Rep_Data!P125))","v":"-"},{"$f":"IF(Rep_Data!Q125 = 0, \"-\",IF(Rep_Data!Q125 = \"\",\"-\",Rep_Data!Q125))","v":"-"},{"$f":"IF(Rep_Data!R125 = 0, \"-\",IF(Rep_Data!R125 = \"\",\"-\",Rep_Data!R125))","v":"-"},null,null,null,null,null,null,null,null,null,null,null,null,null,{"$f":"Table1[[#This Row],[Speciality]]&Table1[[#This Row],[Q1]]","v":"GP-"}]
[null,124,{"$f":"Rep_Data!A126","v":"KENDRA,  GEORGETTE"},{"$f":"Rep_Data!C126","v":"O57492"},{"$f":"Rep_Data!G126","v":"Jacksonville"},{"$f":"Rep_Data!H126","v":"MO"},{"$f":"Rep_Data!I126","v":"65260"},{"$f":"Rep_Data!J126","v":"GP"},{"$f":"IF(Rep_Data!N126 = 0, \"-\",IF(Rep_Data!N126 = \"\",\"-\",Rep_Data!N126))","v":"-"},{"$f":"IF(Rep_Data!O126 = 0, \"-\",IF(Rep_Data!O126 = \"\",\"-\",Rep_Data!O126))","v":"-"},{"$f":"IF(Rep_Data!P126 = 0, \"-\",IF(Rep_Data!P126 = \"\",\"-\",Rep_Data!P126))","v":"-"},{"$f":"IF(Rep_Data!Q126 = 0, \"-\",IF(Rep_Data!Q126 = \"\",\"-\",Rep_Data!Q126))","v":"-"},{"$f":"IF(Rep_Data!R126 = 0, \"-\",IF(Rep_Data!R126 = \"\",\"-\",Rep_Data!R126))","v":"-"},null,null,null,null,null,null,null,null,null,null,null,null,null,{"$f":"Table1[[#This Row],[Speciality]]&Table1[[#This Row],[Q1]]","v":"GP-"}]
[null,125,{"$f":"Rep_Data!A127","v":"KENNETH,  DELL"},{"$f":"Rep_Data!C127","v":"O55014"},{"$f":"Rep_Data!G127","v":"Seadrift"},{"$f":"Rep_Data!H127","v":"TX"},{"$f":"Rep_Data!I127","v":"77983"},{"$f":"Rep_Data!J127","v":"GP"},{"$f":"IF(Rep_Data!N127 = 0, \"-\",IF(Rep_Data!N127 = \"\",\"-\",Rep_Data!N127))","v":"-"},{"$f":"IF(Rep_Data!O127 = 0, \"-\",IF(Rep_Data!O127 = \"\",\"-\",Rep_Data!O127))","v":"-"},{"$f":"IF(Rep_Data!P127 = 0, \"-\",IF(Rep_Data!P127 = \"\",\"-\",Rep_Data!P127))","v":"-"},{"$f":"IF(Rep_Data!Q127 = 0, \"-\",IF(Rep_Data!Q127 = \"\",\"-\",Rep_Data!Q127))","v":"-"},{"$f":"IF(Rep_Data!R127 = 0, \"-\",IF(Rep_Data!R127 = \"\",\"-\",Rep_Data!R127))","v":"-"},null,null,null,null,null,null,null,null,null,null,null,null,null,{"$f":"Table1[[#This Row],[Speciality]]&Table1[[#This Row],[Q1]]","v":"GP-"}]
[null,126,{"$f":"Rep_Data!A128","v":"KENT,  OLIVA"},{"$f":"Rep_Data!C128","v":"O75648"},{"$f":"Rep_Data!G128","v":"South Bend"},{"$f":"Rep_Data!H128","v":"IN"},{"$f":"Rep_Data!I128","v":"46699"},{"$f":"Rep_Data!J128","v":"Ortho"},{"$f":"IF(Rep_Data!N128 = 0, \"-\",IF(Rep_Data!N128 = \"\",\"-\",Rep_Data!N128))","v":"YES"},{"$f":"IF(Rep_Data!O128 = 0, \"-\",IF(Rep_Data!O128 = \"\",\"-\",Rep_Data!O128))","v":"1 - 2"},{"$f":"IF(Rep_Data!P128 = 0, \"-\",IF(Rep_Data!P128 = \"\",\"-\",Rep_Data!P128))","v":"NONE"},{"$f":"IF(Rep_Data!Q128 = 0, \"-\",IF(Rep_Data!Q128 = \"\",\"-\",Rep_Data!Q128))","v":"1"},{"$f":"IF(Rep_Data!R128 = 0, \"-\",IF(Rep_Data!R128 = \"\",\"-\",Rep_Data!R128))","v":"2 or Less"},null,null,null,null,null,null,null,null,null,null,null,null,null,{"$f":"Table1[[#This Row],[Speciality]]&Table1[[#This Row],[Q1]]","v":"OrthoYES"}]
[null,127,{"$f":"Rep_Data!A129","v":"KUM,  LASONYA"},{"$f":"Rep_Data!C129","v":"O52495"},{"$f":"Rep_Data!G129","v":"Spring Glen"},{"$f":"Rep_Data!H129","v":"PA"},{"$f":"Rep_Data!I129","v":"17978"},{"$f":"Rep_Data!J129","v":"Surgery"},{"$f":"IF(Rep_Data!N129 = 0, \"-\",IF(Rep_Data!N129 = \"\",\"-\",Rep_Data!N129))","v":"-"},{"$f":"IF(Rep_Data!O129 = 0, \"-\",IF(Rep_Data!O129 = \"\",\"-\",Rep_Data!O129))","v":"-"},{"$f":"IF(Rep_Data!P129 = 0, \"-\",IF(Rep_Data!P129 = \"\",\"-\",Rep_Data!P129))","v":"-"},{"$f":"IF(Rep_Data!Q129 = 0, \"-\",IF(Rep_Data!Q129 = \"\",\"-\",Rep_Data!Q129))","v":"-"},{"$f":"IF(Rep_Data!R129 = 0, \"-\",IF(Rep_Data!R129 = \"\",\"-\",Rep_Data!R129))","v":"-"},null,null,null,null,null,null,null,null,null,null,null,null,null,{"$f":"Table1[[#This Row],[Speciality]]&Table1[[#This Row],[Q1]]","v":"Surgery-"}]
[null,128,{"$f":"Rep_Data!A130","v":"KYLEE,  LESA"},{"$f":"Rep_Data!C130","v":"O76721"},{"$f":"Rep_Data!G130","v":"Mayer"},{"$f":"Rep_Data!H130","v":"AZ"},{"$f":"Rep_Data!I130","v":"86333"},{"$f":"Rep_Data!J130","v":"GP"},{"$f":"IF(Rep_Data!N130 = 0, \"-\",IF(Rep_Data!N130 = \"\",\"-\",Rep_Data!N130))","v":"YES"},{"$f":"IF(Rep_Data!O130 = 0, \"-\",IF(Rep_Data!O130 = \"\",\"-\",Rep_Data!O130))","v":"1 - 2"},{"$f":"IF(Rep_Data!P130 = 0, \"-\",IF(Rep_Data!P130 = \"\",\"-\",Rep_Data!P130))","v":"NONE"},{"$f":"IF(Rep_Data!Q130 = 0, \"-\",IF(Rep_Data!Q130 = \"\",\"-\",Rep_Data!Q130))","v":"1"},{"$f":"IF(Rep_Data!R130 = 0, \"-\",IF(Rep_Data!R130 = \"\",\"-\",Rep_Data!R130))","v":"2 or Less"},null,null,null,null,null,null,null,null,null,null,null,null,null,{"$f":"Table1[[#This Row],[Speciality]]&Table1[[#This Row],[Q1]]","v":"GPYES"}]
[null,129,{"$f":"Rep_Data!A131","v":"LANNIE,  ELEANORA"},{"$f":"Rep_Data!C131","v":"O72101"},{"$f":"Rep_Data!G131","v":"Hobson"},{"$f":"Rep_Data!H131","v":"TX"},{"$f":"Rep_Data!I131","v":"78117"},{"$f":"Rep_Data!J131","v":"GP"},{"$f":"IF(Rep_Data!N131 = 0, \"-\",IF(Rep_Data!N131 = \"\",\"-\",Rep_Data!N131))","v":"-"},{"$f":"IF(Rep_Data!O131 = 0, \"-\",IF(Rep_Data!O131 = \"\",\"-\",Rep_Data!O131))","v":"-"},{"$f":"IF(Rep_Data!P131 = 0, \"-\",IF(Rep_Data!P131 = \"\",\"-\",Rep_Data!P131))","v":"-"},{"$f":"IF(Rep_Data!Q131 = 0, \"-\",IF(Rep_Data!Q131 = \"\",\"-\",Rep_Data!Q131))","v":"-"},{"$f":"IF(Rep_Data!R131 = 0, \"-\",IF(Rep_Data!R131 = \"\",\"-\",Rep_Data!R131))","v":"-"},null,null,null,null,null,null,null,null,null,null,null,null,null,{"$f":"Table1[[#This Row],[Speciality]]&Table1[[#This Row],[Q1]]","v":"GP-"}]
[null,130,{"$f":"Rep_Data!A132","v":"LAREE,  CLAUDE"},{"$f":"Rep_Data!C132","v":"O59900"},{"$f":"Rep_Data!G132","v":"Lansing"},{"$f":"Rep_Data!H132","v":"MI"},{"$f":"Rep_Data!I132","v":"48919"},{"$f":"Rep_Data!J132","v":"GP"},{"$f":"IF(Rep_Data!N132 = 0, \"-\",IF(Rep_Data!N132 = \"\",\"-\",Rep_Data!N132))","v":"-"},{"$f":"IF(Rep_Data!O132 = 0, \"-\",IF(Rep_Data!O132 = \"\",\"-\",Rep_Data!O132))","v":"-"},{"$f":"IF(Rep_Data!P132 = 0, \"-\",IF(Rep_Data!P132 = \"\",\"-\",Rep_Data!P132))","v":"-"},{"$f":"IF(Rep_Data!Q132 = 0, \"-\",IF(Rep_Data!Q132 = \"\",\"-\",Rep_Data!Q132))","v":"-"},{"$f":"IF(Rep_Data!R132 = 0, \"-\",IF(Rep_Data!R132 = \"\",\"-\",Rep_Data!R132))","v":"-"},null,null,null,null,null,null,null,null,null,null,null,null,null,{"$f":"Table1[[#This Row],[Speciality]]&Table1[[#This Row],[Q1]]","v":"GP-"}]
[null,131,{"$f":"Rep_Data!A133","v":"LASHAWN,  CATHIE"},{"$f":"Rep_Data!C133","v":"O78651"},{"$f":"Rep_Data!G133","v":"Grand Coteau"},{"$f":"Rep_Data!H133","v":"LA"},{"$f":"Rep_Data!I133","v":"70541"},{"$f":"Rep_Data!J133","v":"GP"},{"$f":"IF(Rep_Data!N133 = 0, \"-\",IF(Rep_Data!N133 = \"\",\"-\",Rep_Data!N133))","v":"-"},{"$f":"IF(Rep_Data!O133 = 0, \"-\",IF(Rep_Data!O133 = \"\",\"-\",Rep_Data!O133))","v":"-"},{"$f":"IF(Rep_Data!P133 = 0, \"-\",IF(Rep_Data!P133 = \"\",\"-\",Rep_Data!P133))","v":"-"},{"$f":"IF(Rep_Data!Q133 = 0, \"-\",IF(Rep_Data!Q133 = \"\",\"-\",Rep_Data!Q133))","v":"-"},{"$f":"IF(Rep_Data!R133 = 0, \"-\",IF(Rep_Data!R133 = \"\",\"-\",Rep_Data!R133))","v":"-"},null,null,null,null,null,null,null,null,null,null,null,null,null,{"$f":"Table1[[#This Row],[Speciality]]&Table1[[#This Row],[Q1]]","v":"GP-"}]
[null,132,{"$f":"Rep_Data!A134","v":"LASHAWN,  MARK"},{"$f":"Rep_Data!C134","v":"O58757"},{"$f":"Rep_Data!G134","v":"Orlando"},{"$f":"Rep_Data!H134","v":"FL"},{"$f":"Rep_Data!I134","v":"32818"},{"$f":"Rep_Data!J134","v":"GP"},{"$f":"IF(Rep_Data!N134 = 0, \"-\",IF(Rep_Data!N134 = \"\",\"-\",Rep_Data!N134))","v":"-"},{"$f":"IF(Rep_Data!O134 = 0, \"-\",IF(Rep_Data!O134 = \"\",\"-\",Rep_Data!O134))","v":"-"},{"$f":"IF(Rep_Data!P134 = 0, \"-\",IF(Rep_Data!P134 = \"\",\"-\",Rep_Data!P134))","v":"-"},{"$f":"IF(Rep_Data!Q134 = 0, \"-\",IF(Rep_Data!Q134 = \"\",\"-\",Rep_Data!Q134))","v":"-"},{"$f":"IF(Rep_Data!R134 = 0, \"-\",IF(Rep_Data!R134 = \"\",\"-\",Rep_Data!R134))","v":"-"},null,null,null,null,null,null,null,null,null,null,null,null,null,{"$f":"Table1[[#This Row],[Speciality]]&Table1[[#This Row],[Q1]]","v":"GP-"}]
[null,133,{"$f":"Rep_Data!A135","v":"LAURENCE,  VERNITA"},{"$f":"Rep_Data!C135","v":"O67015"},{"$f":"Rep_Data!G135","v":"Mammoth Lakes"},{"$f":"Rep_Data!H135","v":"CA"},{"$f":"Rep_Data!I135","v":"93546"},{"$f":"Rep_Data!J135","v":"Ortho"},{"$f":"IF(Rep_Data!N135 = 0, \"-\",IF(Rep_Data!N135 = \"\",\"-\",Rep_Data!N135))","v":"-"},{"$f":"IF(Rep_Data!O135 = 0, \"-\",IF(Rep_Data!O135 = \"\",\"-\",Rep_Data!O135))","v":"-"},{"$f":"IF(Rep_Data!P135 = 0, \"-\",IF(Rep_Data!P135 = \"\",\"-\",Rep_Data!P135))","v":"-"},{"$f":"IF(Rep_Data!Q135 = 0, \"-\",IF(Rep_Data!Q135 = \"\",\"-\",Rep_Data!Q135))","v":"-"},{"$f":"IF(Rep_Data!R135 = 0, \"-\",IF(Rep_Data!R135 = \"\",\"-\",Rep_Data!R135))","v":"-"},null,null,null,null,null,null,null,null,null,null,null,null,null,{"$f":"Table1[[#This Row],[Speciality]]&Table1[[#This Row],[Q1]]","v":"Ortho-"}]
[null,134,{"$f":"Rep_Data!A136","v":"LAURI,  JAMIE"},{"$f":"Rep_Data!C136","v":"O63791"},{"$f":"Rep_Data!G136","v":"Steen"},{"$f":"Rep_Data!H136","v":"MN"},{"$f":"Rep_Data!I136","v":"56173"},{"$f":"Rep_Data!J136","v":"GP"},{"$f":"IF(Rep_Data!N136 = 0, \"-\",IF(Rep_Data!N136 = \"\",\"-\",Rep_Data!N136))","v":"-"},{"$f":"IF(Rep_Data!O136 = 0, \"-\",IF(Rep_Data!O136 = \"\",\"-\",Rep_Data!O136))","v":"-"},{"$f":"IF(Rep_Data!P136 = 0, \"-\",IF(Rep_Data!P136 = \"\",\"-\",Rep_Data!P136))","v":"-"},{"$f":"IF(Rep_Data!Q136 = 0, \"-\",IF(Rep_Data!Q136 = \"\",\"-\",Rep_Data!Q136))","v":"-"},{"$f":"IF(Rep_Data!R136 = 0, \"-\",IF(Rep_Data!R136 = \"\",\"-\",Rep_Data!R136))","v":"-"},null,null,null,null,null,null,null,null,null,null,null,null,null,{"$f":"Table1[[#This Row],[Speciality]]&Table1[[#This Row],[Q1]]","v":"GP-"}]
[null,135,{"$f":"Rep_Data!A137","v":"LAURINDA,  ZACHERY"},{"$f":"Rep_Data!C137","v":"O68322"},{"$f":"Rep_Data!G137","v":"Goodrich"},{"$f":"Rep_Data!H137","v":"MI"},{"$f":"Rep_Data!I137","v":"48438"},{"$f":"Rep_Data!J137","v":"GP"},{"$f":"IF(Rep_Data!N137 = 0, \"-\",IF(Rep_Data!N137 = \"\",\"-\",Rep_Data!N137))","v":"YES"},{"$f":"IF(Rep_Data!O137 = 0, \"-\",IF(Rep_Data!O137 = \"\",\"-\",Rep_Data!O137))","v":"1 - 2"},{"$f":"IF(Rep_Data!P137 = 0, \"-\",IF(Rep_Data!P137 = \"\",\"-\",Rep_Data!P137))","v":"NONE"},{"$f":"IF(Rep_Data!Q137 = 0, \"-\",IF(Rep_Data!Q137 = \"\",\"-\",Rep_Data!Q137))","v":"1"},{"$f":"IF(Rep_Data!R137 = 0, \"-\",IF(Rep_Data!R137 = \"\",\"-\",Rep_Data!R137))","v":"2 or Less"},null,null,null,null,null,null,null,null,null,null,null,null,null,{"$f":"Table1[[#This Row],[Speciality]]&Table1[[#This Row],[Q1]]","v":"GPYES"}]
[null,136,{"$f":"Rep_Data!A138","v":"LAWRENCE,  LEONTINE"},{"$f":"Rep_Data!C138","v":"O70890"},{"$f":"Rep_Data!G138","v":"Springfield"},{"$f":"Rep_Data!H138","v":"SC"},{"$f":"Rep_Data!I138","v":"29146"},{"$f":"Rep_Data!J138","v":"GP"},{"$f":"IF(Rep_Data!N138 = 0, \"-\",IF(Rep_Data!N138 = \"\",\"-\",Rep_Data!N138))","v":"-"},{"$f":"IF(Rep_Data!O138 = 0, \"-\",IF(Rep_Data!O138 = \"\",\"-\",Rep_Data!O138))","v":"-"},{"$f":"IF(Rep_Data!P138 = 0, \"-\",IF(Rep_Data!P138 = \"\",\"-\",Rep_Data!P138))","v":"-"},{"$f":"IF(Rep_Data!Q138 = 0, \"-\",IF(Rep_Data!Q138 = \"\",\"-\",Rep_Data!Q138))","v":"-"},{"$f":"IF(Rep_Data!R138 = 0, \"-\",IF(Rep_Data!R138 = \"\",\"-\",Rep_Data!R138))","v":"-"},null,null,null,null,null,null,null,null,null,null,null,null,null,{"$f":"Table1[[#This Row],[Speciality]]&Table1[[#This Row],[Q1]]","v":"GP-"}]
[null,137,{"$f":"Rep_Data!A139","v":"LAYLA,  RIVKA"},{"$f":"Rep_Data!C139","v":"O55531"},{"$f":"Rep_Data!G139","v":"South Boardman"},{"$f":"Rep_Data!H139","v":"MI"},{"$f":"Rep_Data!I139","v":"49680"},{"$f":"Rep_Data!J139","v":"GP"},{"$f":"IF(Rep_Data!N139 = 0, \"-\",IF(Rep_Data!N139 = \"\",\"-\",Rep_Data!N139))","v":"-"},{"$f":"IF(Rep_Data!O139 = 0, \"-\",IF(Rep_Data!O139 = \"\",\"-\",Rep_Data!O139))","v":"-"},{"$f":"IF(Rep_Data!P139 = 0, \"-\",IF(Rep_Data!P139 = \"\",\"-\",Rep_Data!P139))","v":"-"},{"$f":"IF(Rep_Data!Q139 = 0, \"-\",IF(Rep_Data!Q139 = \"\",\"-\",Rep_Data!Q139))","v":"-"},{"$f":"IF(Rep_Data!R139 = 0, \"-\",IF(Rep_Data!R139 = \"\",\"-\",Rep_Data!R139))","v":"-"},null,null,null,null,null,null,null,null,null,null,null,null,null,{"$f":"Table1[[#This Row],[Speciality]]&Table1[[#This Row],[Q1]]","v":"GP-"}]
[null,138,{"$f":"Rep_Data!A140","v":"LEAN,  ROBERTO"},{"$f":"Rep_Data!C140","v":"O71798"},{"$f":"Rep_Data!G140","v":"Riddlesburg"},{"$f":"Rep_Data!H140","v":"PA"},{"$f":"Rep_Data!I140","v":"16672"},{"$f":"Rep_Data!J140","v":"GP"},{"$f":"IF(Rep_Data!N140 = 0, \"-\",IF(Rep_Data!N140 = \"\",\"-\",Rep_Data!N140))","v":"-"},{"$f":"IF(Rep_Data!O140 = 0, \"-\",IF(Rep_Data!O140 = \"\",\"-\",Rep_Data!O140))","v":"-"},{"$f":"IF(Rep_Data!P140 = 0, \"-\",IF(Rep_Data!P140 = \"\",\"-\",Rep_Data!P140))","v":"-"},{"$f":"IF(Rep_Data!Q140 = 0, \"-\",IF(Rep_Data!Q140 = \"\",\"-\",Rep_Data!Q140))","v":"-"},{"$f":"IF(Rep_Data!R140 = 0, \"-\",IF(Rep_Data!R140 = \"\",\"-\",Rep_Data!R140))","v":"-"},null,null,null,null,null,null,null,null,null,null,null,null,null,{"$f":"Table1[[#This Row],[Speciality]]&Table1[[#This Row],[Q1]]","v":"GP-"}]
[null,139,{"$f":"Rep_Data!A141","v":"LEKISHA,  ETHYL"},{"$f":"Rep_Data!C141","v":"O56147"},{"$f":"Rep_Data!G141","v":"Jacksonville"},{"$f":"Rep_Data!H141","v":"FL"},{"$f":"Rep_Data!I141","v":"32225"},{"$f":"Rep_Data!J141","v":"Surgery"},{"$f":"IF(Rep_Data!N141 = 0, \"-\",IF(Rep_Data!N141 = \"\",\"-\",Rep_Data!N141))","v":"-"},{"$f":"IF(Rep_Data!O141 = 0, \"-\",IF(Rep_Data!O141 = \"\",\"-\",Rep_Data!O141))","v":"-"},{"$f":"IF(Rep_Data!P141 = 0, \"-\",IF(Rep_Data!P141 = \"\",\"-\",Rep_Data!P141))","v":"-"},{"$f":"IF(Rep_Data!Q141 = 0, \"-\",IF(Rep_Data!Q141 = \"\",\"-\",Rep_Data!Q141))","v":"-"},{"$f":"IF(Rep_Data!R141 = 0, \"-\",IF(Rep_Data!R141 = \"\",\"-\",Rep_Data!R141))","v":"-"},null,null,null,null,null,null,null,null,null,null,null,null,null,{"$f":"Table1[[#This Row],[Speciality]]&Table1[[#This Row],[Q1]]","v":"Surgery-"}]
[null,140,{"$f":"Rep_Data!A142","v":"LELAH,  KARLENE"},{"$f":"Rep_Data!C142","v":"O71271"},{"$f":"Rep_Data!G142","v":"Lincoln's New Salem"},{"$f":"Rep_Data!H142","v":"IL"},{"$f":"Rep_Data!I142","v":"62659"},{"$f":"Rep_Data!J142","v":"GP"},{"$f":"IF(Rep_Data!N142 = 0, \"-\",IF(Rep_Data!N142 = \"\",\"-\",Rep_Data!N142))","v":"-"},{"$f":"IF(Rep_Data!O142 = 0, \"-\",IF(Rep_Data!O142 = \"\",\"-\",Rep_Data!O142))","v":"-"},{"$f":"IF(Rep_Data!P142 = 0, \"-\",IF(Rep_Data!P142 = \"\",\"-\",Rep_Data!P142))","v":"-"},{"$f":"IF(Rep_Data!Q142 = 0, \"-\",IF(Rep_Data!Q142 = \"\",\"-\",Rep_Data!Q142))","v":"-"},{"$f":"IF(Rep_Data!R142 = 0, \"-\",IF(Rep_Data!R142 = \"\",\"-\",Rep_Data!R142))","v":"-"},null,null,null,null,null,null,null,null,null,null,null,null,null,{"$f":"Table1[[#This Row],[Speciality]]&Table1[[#This Row],[Q1]]","v":"GP-"}]
[null,141,{"$f":"Rep_Data!A143","v":"LENARD,  FATIMAH"},{"$f":"Rep_Data!C143","v":"O74081"},{"$f":"Rep_Data!G143","v":"Camden"},{"$f":"Rep_Data!H143","v":"NJ"},{"$f":"Rep_Data!I143","v":"08102"},{"$f":"Rep_Data!J143","v":"Surgery"},{"$f":"IF(Rep_Data!N143 = 0, \"-\",IF(Rep_Data!N143 = \"\",\"-\",Rep_Data!N143))","v":"-"},{"$f":"IF(Rep_Data!O143 = 0, \"-\",IF(Rep_Data!O143 = \"\",\"-\",Rep_Data!O143))","v":"-"},{"$f":"IF(Rep_Data!P143 = 0, \"-\",IF(Rep_Data!P143 = \"\",\"-\",Rep_Data!P143))","v":"-"},{"$f":"IF(Rep_Data!Q143 = 0, \"-\",IF(Rep_Data!Q143 = \"\",\"-\",Rep_Data!Q143))","v":"-"},{"$f":"IF(Rep_Data!R143 = 0, \"-\",IF(Rep_Data!R143 = \"\",\"-\",Rep_Data!R143))","v":"-"},null,null,null,null,null,null,null,null,null,null,null,null,null,{"$f":"Table1[[#This Row],[Speciality]]&Table1[[#This Row],[Q1]]","v":"Surgery-"}]
[null,142,{"$f":"Rep_Data!A144","v":"LENNA,  EDITH"},{"$f":"Rep_Data!C144","v":"O59422"},{"$f":"Rep_Data!G144","v":"San Bernardino"},{"$f":"Rep_Data!H144","v":"CA"},{"$f":"Rep_Data!I144","v":"92424"},{"$f":"Rep_Data!J144","v":"Ortho"},{"$f":"IF(Rep_Data!N144 = 0, \"-\",IF(Rep_Data!N144 = \"\",\"-\",Rep_Data!N144))","v":"-"},{"$f":"IF(Rep_Data!O144 = 0, \"-\",IF(Rep_Data!O144 = \"\",\"-\",Rep_Data!O144))","v":"-"},{"$f":"IF(Rep_Data!P144 = 0, \"-\",IF(Rep_Data!P144 = \"\",\"-\",Rep_Data!P144))","v":"-"},{"$f":"IF(Rep_Data!Q144 = 0, \"-\",IF(Rep_Data!Q144 = \"\",\"-\",Rep_Data!Q144))","v":"-"},{"$f":"IF(Rep_Data!R144 = 0, \"-\",IF(Rep_Data!R144 = \"\",\"-\",Rep_Data!R144))","v":"-"},null,null,null,null,null,null,null,null,null,null,null,null,null,{"$f":"Table1[[#This Row],[Speciality]]&Table1[[#This Row],[Q1]]","v":"Ortho-"}]
[null,143,{"$f":"Rep_Data!A145","v":"LETA,  EVE"},{"$f":"Rep_Data!C145","v":"O59652"},{"$f":"Rep_Data!G145","v":"Milton Village"},{"$f":"Rep_Data!H145","v":"MA"},{"$f":"Rep_Data!I145","v":"02187"},{"$f":"Rep_Data!J145","v":"GP"},{"$f":"IF(Rep_Data!N145 = 0, \"-\",IF(Rep_Data!N145 = \"\",\"-\",Rep_Data!N145))","v":"-"},{"$f":"IF(Rep_Data!O145 = 0, \"-\",IF(Rep_Data!O145 = \"\",\"-\",Rep_Data!O145))","v":"-"},{"$f":"IF(Rep_Data!P145 = 0, \"-\",IF(Rep_Data!P145 = \"\",\"-\",Rep_Data!P145))","v":"-"},{"$f":"IF(Rep_Data!Q145 = 0, \"-\",IF(Rep_Data!Q145 = \"\",\"-\",Rep_Data!Q145))","v":"-"},{"$f":"IF(Rep_Data!R145 = 0, \"-\",IF(Rep_Data!R145 = \"\",\"-\",Rep_Data!R145))","v":"-"},null,null,null,null,null,null,null,null,null,null,null,null,null,{"$f":"Table1[[#This Row],[Speciality]]&Table1[[#This Row],[Q1]]","v":"GP-"}]
[null,144,{"$f":"Rep_Data!A146","v":"LIBBIE,  CHRISTY"},{"$f":"Rep_Data!C146","v":"O59535"},{"$f":"Rep_Data!G146","v":"San Simeon"},{"$f":"Rep_Data!H146","v":"CA"},{"$f":"Rep_Data!I146","v":"93452"},{"$f":"Rep_Data!J146","v":"GP"},{"$f":"IF(Rep_Data!N146 = 0, \"-\",IF(Rep_Data!N146 = \"\",\"-\",Rep_Data!N146))","v":"-"},{"$f":"IF(Rep_Data!O146 = 0, \"-\",IF(Rep_Data!O146 = \"\",\"-\",Rep_Data!O146))","v":"-"},{"$f":"IF(Rep_Data!P146 = 0, \"-\",IF(Rep_Data!P146 = \"\",\"-\",Rep_Data!P146))","v":"-"},{"$f":"IF(Rep_Data!Q146 = 0, \"-\",IF(Rep_Data!Q146 = \"\",\"-\",Rep_Data!Q146))","v":"-"},{"$f":"IF(Rep_Data!R146 = 0, \"-\",IF(Rep_Data!R146 = \"\",\"-\",Rep_Data!R146))","v":"-"},null,null,null,null,null,null,null,null,null,null,null,null,null,{"$f":"Table1[[#This Row],[Speciality]]&Table1[[#This Row],[Q1]]","v":"GP-"}]
[null,145,{"$f":"Rep_Data!A147","v":"LILY,  DEBBY"},{"$f":"Rep_Data!C147","v":"O78728"},{"$f":"Rep_Data!G147","v":"Houston"},{"$f":"Rep_Data!H147","v":"TX"},{"$f":"Rep_Data!I147","v":"77216"},{"$f":"Rep_Data!J147","v":"GP"},{"$f":"IF(Rep_Data!N147 = 0, \"-\",IF(Rep_Data!N147 = \"\",\"-\",Rep_Data!N147))","v":"-"},{"$f":"IF(Rep_Data!O147 = 0, \"-\",IF(Rep_Data!O147 = \"\",\"-\",Rep_Data!O147))","v":"-"},{"$f":"IF(Rep_Data!P147 = 0, \"-\",IF(Rep_Data!P147 = \"\",\"-\",Rep_Data!P147))","v":"-"},{"$f":"IF(Rep_Data!Q147 = 0, \"-\",IF(Rep_Data!Q147 = \"\",\"-\",Rep_Data!Q147))","v":"-"},{"$f":"IF(Rep_Data!R147 = 0, \"-\",IF(Rep_Data!R147 = \"\",\"-\",Rep_Data!R147))","v":"-"},null,null,null,null,null,null,null,null,null,null,null,null,null,{"$f":"Table1[[#This Row],[Speciality]]&Table1[[#This Row],[Q1]]","v":"GP-"}]
[null,146,{"$f":"Rep_Data!A148","v":"LIZA,  GLAYDS"},{"$f":"Rep_Data!C148","v":"O57690"},{"$f":"Rep_Data!G148","v":"Spartanburg"},{"$f":"Rep_Data!H148","v":"SC"},{"$f":"Rep_Data!I148","v":"29318"},{"$f":"Rep_Data!J148","v":"GP"},{"$f":"IF(Rep_Data!N148 = 0, \"-\",IF(Rep_Data!N148 = \"\",\"-\",Rep_Data!N148))","v":"-"},{"$f":"IF(Rep_Data!O148 = 0, \"-\",IF(Rep_Data!O148 = \"\",\"-\",Rep_Data!O148))","v":"-"},{"$f":"IF(Rep_Data!P148 = 0, \"-\",IF(Rep_Data!P148 = \"\",\"-\",Rep_Data!P148))","v":"-"},{"$f":"IF(Rep_Data!Q148 = 0, \"-\",IF(Rep_Data!Q148 = \"\",\"-\",Rep_Data!Q148))","v":"-"},{"$f":"IF(Rep_Data!R148 = 0, \"-\",IF(Rep_Data!R148 = \"\",\"-\",Rep_Data!R148))","v":"-"},null,null,null,null,null,null,null,null,null,null,null,null,null,{"$f":"Table1[[#This Row],[Speciality]]&Table1[[#This Row],[Q1]]","v":"GP-"}]
[null,147,{"$f":"Rep_Data!A149","v":"LIZETH,  RODOLFO"},{"$f":"Rep_Data!C149","v":"O74897"},{"$f":"Rep_Data!G149","v":"New Smyrna Beach"},{"$f":"Rep_Data!H149","v":"FL"},{"$f":"Rep_Data!I149","v":"32169"},{"$f":"Rep_Data!J149","v":"GP"},{"$f":"IF(Rep_Data!N149 = 0, \"-\",IF(Rep_Data!N149 = \"\",\"-\",Rep_Data!N149))","v":"-"},{"$f":"IF(Rep_Data!O149 = 0, \"-\",IF(Rep_Data!O149 = \"\",\"-\",Rep_Data!O149))","v":"-"},{"$f":"IF(Rep_Data!P149 = 0, \"-\",IF(Rep_Data!P149 = \"\",\"-\",Rep_Data!P149))","v":"-"},{"$f":"IF(Rep_Data!Q149 = 0, \"-\",IF(Rep_Data!Q149 = \"\",\"-\",Rep_Data!Q149))","v":"-"},{"$f":"IF(Rep_Data!R149 = 0, \"-\",IF(Rep_Data!R149 = \"\",\"-\",Rep_Data!R149))","v":"-"},null,null,null,null,null,null,null,null,null,null,null,null,null,{"$f":"Table1[[#This Row],[Speciality]]&Table1[[#This Row],[Q1]]","v":"GP-"}]
[null,148,{"$f":"Rep_Data!A150","v":"LOREN,  DIEGO"},{"$f":"Rep_Data!C150","v":"O52422"},{"$f":"Rep_Data!G150","v":"South Bend"},{"$f":"Rep_Data!H150","v":"IN"},{"$f":"Rep_Data!I150","v":"46624"},{"$f":"Rep_Data!J150","v":"Ortho"},{"$f":"IF(Rep_Data!N150 = 0, \"-\",IF(Rep_Data!N150 = \"\",\"-\",Rep_Data!N150))","v":"YES"},{"$f":"IF(Rep_Data!O150 = 0, \"-\",IF(Rep_Data!O150 = \"\",\"-\",Rep_Data!O150))","v":"1 - 2"},{"$f":"IF(Rep_Data!P150 = 0, \"-\",IF(Rep_Data!P150 = \"\",\"-\",Rep_Data!P150))","v":"NONE"},{"$f":"IF(Rep_Data!Q150 = 0, \"-\",IF(Rep_Data!Q150 = \"\",\"-\",Rep_Data!Q150))","v":"1"},{"$f":"IF(Rep_Data!R150 = 0, \"-\",IF(Rep_Data!R150 = \"\",\"-\",Rep_Data!R150))","v":"2 or Less"},null,null,null,null,null,null,null,null,null,null,null,null,null,{"$f":"Table1[[#This Row],[Speciality]]&Table1[[#This Row],[Q1]]","v":"OrthoYES"}]
[null,149,{"$f":"Rep_Data!A151","v":"LORENA,  ALVERA"},{"$f":"Rep_Data!C151","v":"O59243"},{"$f":"Rep_Data!G151","v":"Boston"},{"$f":"Rep_Data!H151","v":"MA"},{"$f":"Rep_Data!I151","v":"02117"},{"$f":"Rep_Data!J151","v":"Ortho"},{"$f":"IF(Rep_Data!N151 = 0, \"-\",IF(Rep_Data!N151 = \"\",\"-\",Rep_Data!N151))","v":"YES"},{"$f":"IF(Rep_Data!O151 = 0, \"-\",IF(Rep_Data!O151 = \"\",\"-\",Rep_Data!O151))","v":"1 - 2"},{"$f":"IF(Rep_Data!P151 = 0, \"-\",IF(Rep_Data!P151 = \"\",\"-\",Rep_Data!P151))","v":"NONE"},{"$f":"IF(Rep_Data!Q151 = 0, \"-\",IF(Rep_Data!Q151 = \"\",\"-\",Rep_Data!Q151))","v":"1"},{"$f":"IF(Rep_Data!R151 = 0, \"-\",IF(Rep_Data!R151 = \"\",\"-\",Rep_Data!R151))","v":"2 or Less"},null,null,null,null,null,null,null,null,null,null,null,null,null,{"$f":"Table1[[#This Row],[Speciality]]&Table1[[#This Row],[Q1]]","v":"OrthoYES"}]
[null,150,{"$f":"Rep_Data!A152","v":"LUCILLA,  CHRISTENA"},{"$f":"Rep_Data!C152","v":"O56014"},{"$f":"Rep_Data!G152","v":"Chicago"},{"$f":"Rep_Data!H152","v":"IL"},{"$f":"Rep_Data!I152","v":"60660"},{"$f":"Rep_Data!J152","v":"Ortho"},{"$f":"IF(Rep_Data!N152 = 0, \"-\",IF(Rep_Data!N152 = \"\",\"-\",Rep_Data!N152))","v":"YES"},{"$f":"IF(Rep_Data!O152 = 0, \"-\",IF(Rep_Data!O152 = \"\",\"-\",Rep_Data!O152))","v":"1 - 2"},{"$f":"IF(Rep_Data!P152 = 0, \"-\",IF(Rep_Data!P152 = \"\",\"-\",Rep_Data!P152))","v":"NONE"},{"$f":"IF(Rep_Data!Q152 = 0, \"-\",IF(Rep_Data!Q152 = \"\",\"-\",Rep_Data!Q152))","v":"1"},{"$f":"IF(Rep_Data!R152 = 0, \"-\",IF(Rep_Data!R152 = \"\",\"-\",Rep_Data!R152))","v":"2 or Less"},null,null,null,null,null,null,null,null,null,null,null,null,null,{"$f":"Table1[[#This Row],[Speciality]]&Table1[[#This Row],[Q1]]","v":"OrthoYES"}]
[null,151,{"$f":"Rep_Data!A153","v":"LUCILLA,  STEVEN"},{"$f":"Rep_Data!C153","v":"O67867"},{"$f":"Rep_Data!G153","v":"Temple"},{"$f":"Rep_Data!H153","v":"TX"},{"$f":"Rep_Data!I153","v":"76503"},{"$f":"Rep_Data!J153","v":"GP"},{"$f":"IF(Rep_Data!N153 = 0, \"-\",IF(Rep_Data!N153 = \"\",\"-\",Rep_Data!N153))","v":"-"},{"$f":"IF(Rep_Data!O153 = 0, \"-\",IF(Rep_Data!O153 = \"\",\"-\",Rep_Data!O153))","v":"-"},{"$f":"IF(Rep_Data!P153 = 0, \"-\",IF(Rep_Data!P153 = \"\",\"-\",Rep_Data!P153))","v":"-"},{"$f":"IF(Rep_Data!Q153 = 0, \"-\",IF(Rep_Data!Q153 = \"\",\"-\",Rep_Data!Q153))","v":"-"},{"$f":"IF(Rep_Data!R153 = 0, \"-\",IF(Rep_Data!R153 = \"\",\"-\",Rep_Data!R153))","v":"-"},null,null,null,null,null,null,null,null,null,null,null,null,null,{"$f":"Table1[[#This Row],[Speciality]]&Table1[[#This Row],[Q1]]","v":"GP-"}]
[null,152,{"$f":"Rep_Data!A154","v":"MADALYN,  ANISSA"},{"$f":"Rep_Data!C154","v":"O76856"},{"$f":"Rep_Data!G154","v":"Kansas City"},{"$f":"Rep_Data!H154","v":"MO"},{"$f":"Rep_Data!I154","v":"64117"},{"$f":"Rep_Data!J154","v":"GP"},{"$f":"IF(Rep_Data!N154 = 0, \"-\",IF(Rep_Data!N154 = \"\",\"-\",Rep_Data!N154))","v":"-"},{"$f":"IF(Rep_Data!O154 = 0, \"-\",IF(Rep_Data!O154 = \"\",\"-\",Rep_Data!O154))","v":"-"},{"$f":"IF(Rep_Data!P154 = 0, \"-\",IF(Rep_Data!P154 = \"\",\"-\",Rep_Data!P154))","v":"-"},{"$f":"IF(Rep_Data!Q154 = 0, \"-\",IF(Rep_Data!Q154 = \"\",\"-\",Rep_Data!Q154))","v":"-"},{"$f":"IF(Rep_Data!R154 = 0, \"-\",IF(Rep_Data!R154 = \"\",\"-\",Rep_Data!R154))","v":"-"},null,null,null,null,null,null,null,null,null,null,null,null,null,{"$f":"Table1[[#This Row],[Speciality]]&Table1[[#This Row],[Q1]]","v":"GP-"}]
[null,153,{"$f":"Rep_Data!A155","v":"MAISIE,  MEI"},{"$f":"Rep_Data!C155","v":"O58603"},{"$f":"Rep_Data!G155","v":"Nashua"},{"$f":"Rep_Data!H155","v":"NH"},{"$f":"Rep_Data!I155","v":"03061"},{"$f":"Rep_Data!J155","v":"GP"},{"$f":"IF(Rep_Data!N155 = 0, \"-\",IF(Rep_Data!N155 = \"\",\"-\",Rep_Data!N155))","v":"-"},{"$f":"IF(Rep_Data!O155 = 0, \"-\",IF(Rep_Data!O155 = \"\",\"-\",Rep_Data!O155))","v":"-"},{"$f":"IF(Rep_Data!P155 = 0, \"-\",IF(Rep_Data!P155 = \"\",\"-\",Rep_Data!P155))","v":"-"},{"$f":"IF(Rep_Data!Q155 = 0, \"-\",IF(Rep_Data!Q155 = \"\",\"-\",Rep_Data!Q155))","v":"-"},{"$f":"IF(Rep_Data!R155 = 0, \"-\",IF(Rep_Data!R155 = \"\",\"-\",Rep_Data!R155))","v":"-"},null,null,null,null,null,null,null,null,null,null,null,null,null,{"$f":"Table1[[#This Row],[Speciality]]&Table1[[#This Row],[Q1]]","v":"GP-"}]
[null,154,{"$f":"Rep_Data!A156","v":"MALIA,  ALLENA"},{"$f":"Rep_Data!C156","v":"O74849"},{"$f":"Rep_Data!G156","v":"Vernonia"},{"$f":"Rep_Data!H156","v":"OR"},{"$f":"Rep_Data!I156","v":"97064"},{"$f":"Rep_Data!J156","v":"Surgery"},{"$f":"IF(Rep_Data!N156 = 0, \"-\",IF(Rep_Data!N156 = \"\",\"-\",Rep_Data!N156))","v":"-"},{"$f":"IF(Rep_Data!O156 = 0, \"-\",IF(Rep_Data!O156 = \"\",\"-\",Rep_Data!O156))","v":"-"},{"$f":"IF(Rep_Data!P156 = 0, \"-\",IF(Rep_Data!P156 = \"\",\"-\",Rep_Data!P156))","v":"-"},{"$f":"IF(Rep_Data!Q156 = 0, \"-\",IF(Rep_Data!Q156 = \"\",\"-\",Rep_Data!Q156))","v":"-"},{"$f":"IF(Rep_Data!R156 = 0, \"-\",IF(Rep_Data!R156 = \"\",\"-\",Rep_Data!R156))","v":"-"},null,null,null,null,null,null,null,null,null,null,null,null,null,{"$f":"Table1[[#This Row],[Speciality]]&Table1[[#This Row],[Q1]]","v":"Surgery-"}]
[null,155,{"$f":"Rep_Data!A157","v":"MARCELINO,  KUM"},{"$f":"Rep_Data!C157","v":"O70996"},{"$f":"Rep_Data!G157","v":"Star Lake"},{"$f":"Rep_Data!H157","v":"NY"},{"$f":"Rep_Data!I157","v":"13690"},{"$f":"Rep_Data!J157","v":"GP"},{"$f":"IF(Rep_Data!N157 = 0, \"-\",IF(Rep_Data!N157 = \"\",\"-\",Rep_Data!N157))","v":"-"},{"$f":"IF(Rep_Data!O157 = 0, \"-\",IF(Rep_Data!O157 = \"\",\"-\",Rep_Data!O157))","v":"-"},{"$f":"IF(Rep_Data!P157 = 0, \"-\",IF(Rep_Data!P157 = \"\",\"-\",Rep_Data!P157))","v":"-"},{"$f":"IF(Rep_Data!Q157 = 0, \"-\",IF(Rep_Data!Q157 = \"\",\"-\",Rep_Data!Q157))","v":"-"},{"$f":"IF(Rep_Data!R157 = 0, \"-\",IF(Rep_Data!R157 = \"\",\"-\",Rep_Data!R157))","v":"-"},null,null,null,null,null,null,null,null,null,null,null,null,null,{"$f":"Table1[[#This Row],[Speciality]]&Table1[[#This Row],[Q1]]","v":"GP-"}]
[null,156,{"$f":"Rep_Data!A158","v":"MARCIA,  NAN"},{"$f":"Rep_Data!C158","v":"O75540"},{"$f":"Rep_Data!G158","v":"West Haven"},{"$f":"Rep_Data!H158","v":"CT"},{"$f":"Rep_Data!I158","v":"06516"},{"$f":"Rep_Data!J158","v":"GP"},{"$f":"IF(Rep_Data!N158 = 0, \"-\",IF(Rep_Data!N158 = \"\",\"-\",Rep_Data!N158))","v":"-"},{"$f":"IF(Rep_Data!O158 = 0, \"-\",IF(Rep_Data!O158 = \"\",\"-\",Rep_Data!O158))","v":"-"},{"$f":"IF(Rep_Data!P158 = 0, \"-\",IF(Rep_Data!P158 = \"\",\"-\",Rep_Data!P158))","v":"-"},{"$f":"IF(Rep_Data!Q158 = 0, \"-\",IF(Rep_Data!Q158 = \"\",\"-\",Rep_Data!Q158))","v":"-"},{"$f":"IF(Rep_Data!R158 = 0, \"-\",IF(Rep_Data!R158 = \"\",\"-\",Rep_Data!R158))","v":"-"},null,null,null,null,null,null,null,null,null,null,null,null,null,{"$f":"Table1[[#This Row],[Speciality]]&Table1[[#This Row],[Q1]]","v":"GP-"}]
[null,157,{"$f":"Rep_Data!A159","v":"MARCIE,  IDELL"},{"$f":"Rep_Data!C159","v":"O75491"},{"$f":"Rep_Data!G159","v":"Detroit"},{"$f":"Rep_Data!H159","v":"MI"},{"$f":"Rep_Data!I159","v":"48235"},{"$f":"Rep_Data!J159","v":"GP"},{"$f":"IF(Rep_Data!N159 = 0, \"-\",IF(Rep_Data!N159 = \"\",\"-\",Rep_Data!N159))","v":"-"},{"$f":"IF(Rep_Data!O159 = 0, \"-\",IF(Rep_Data!O159 = \"\",\"-\",Rep_Data!O159))","v":"-"},{"$f":"IF(Rep_Data!P159 = 0, \"-\",IF(Rep_Data!P159 = \"\",\"-\",Rep_Data!P159))","v":"-"},{"$f":"IF(Rep_Data!Q159 = 0, \"-\",IF(Rep_Data!Q159 = \"\",\"-\",Rep_Data!Q159))","v":"-"},{"$f":"IF(Rep_Data!R159 = 0, \"-\",IF(Rep_Data!R159 = \"\",\"-\",Rep_Data!R159))","v":"-"},null,null,null,null,null,null,null,null,null,null,null,null,null,{"$f":"Table1[[#This Row],[Speciality]]&Table1[[#This Row],[Q1]]","v":"GP-"}]
[null,158,{"$f":"Rep_Data!A160","v":"MARIA,  TIJUANA"},{"$f":"Rep_Data!C160","v":"O68568"},{"$f":"Rep_Data!G160","v":"Shreveport"},{"$f":"Rep_Data!H160","v":"LA"},{"$f":"Rep_Data!I160","v":"71101"},{"$f":"Rep_Data!J160","v":"Surgery"},{"$f":"IF(Rep_Data!N160 = 0, \"-\",IF(Rep_Data!N160 = \"\",\"-\",Rep_Data!N160))","v":"-"},{"$f":"IF(Rep_Data!O160 = 0, \"-\",IF(Rep_Data!O160 = \"\",\"-\",Rep_Data!O160))","v":"-"},{"$f":"IF(Rep_Data!P160 = 0, \"-\",IF(Rep_Data!P160 = \"\",\"-\",Rep_Data!P160))","v":"-"},{"$f":"IF(Rep_Data!Q160 = 0, \"-\",IF(Rep_Data!Q160 = \"\",\"-\",Rep_Data!Q160))","v":"-"},{"$f":"IF(Rep_Data!R160 = 0, \"-\",IF(Rep_Data!R160 = \"\",\"-\",Rep_Data!R160))","v":"-"},null,null,null,null,null,null,null,null,null,null,null,null,null,{"$f":"Table1[[#This Row],[Speciality]]&Table1[[#This Row],[Q1]]","v":"Surgery-"}]
[null,159,{"$f":"Rep_Data!A161","v":"MARIO,  ROLANDO"},{"$f":"Rep_Data!C161","v":"O77130"},{"$f":"Rep_Data!G161","v":"Wildorado"},{"$f":"Rep_Data!H161","v":"TX"},{"$f":"Rep_Data!I161","v":"79098"},{"$f":"Rep_Data!J161","v":"Ortho"},{"$f":"IF(Rep_Data!N161 = 0, \"-\",IF(Rep_Data!N161 = \"\",\"-\",Rep_Data!N161))","v":"-"},{"$f":"IF(Rep_Data!O161 = 0, \"-\",IF(Rep_Data!O161 = \"\",\"-\",Rep_Data!O161))","v":"-"},{"$f":"IF(Rep_Data!P161 = 0, \"-\",IF(Rep_Data!P161 = \"\",\"-\",Rep_Data!P161))","v":"-"},{"$f":"IF(Rep_Data!Q161 = 0, \"-\",IF(Rep_Data!Q161 = \"\",\"-\",Rep_Data!Q161))","v":"-"},{"$f":"IF(Rep_Data!R161 = 0, \"-\",IF(Rep_Data!R161 = \"\",\"-\",Rep_Data!R161))","v":"-"},null,null,null,null,null,null,null,null,null,null,null,null,null,{"$f":"Table1[[#This Row],[Speciality]]&Table1[[#This Row],[Q1]]","v":"Ortho-"}]
[null,160,{"$f":"Rep_Data!A162","v":"MARISELA,  DALILA"},{"$f":"Rep_Data!C162","v":"O63987"},{"$f":"Rep_Data!G162","v":"Mc Leod"},{"$f":"Rep_Data!H162","v":"MT"},{"$f":"Rep_Data!I162","v":"59052"},{"$f":"Rep_Data!J162","v":"Surgery"},{"$f":"IF(Rep_Data!N162 = 0, \"-\",IF(Rep_Data!N162 = \"\",\"-\",Rep_Data!N162))","v":"-"},{"$f":"IF(Rep_Data!O162 = 0, \"-\",IF(Rep_Data!O162 = \"\",\"-\",Rep_Data!O162))","v":"-"},{"$f":"IF(Rep_Data!P162 = 0, \"-\",IF(Rep_Data!P162 = \"\",\"-\",Rep_Data!P162))","v":"-"},{"$f":"IF(Rep_Data!Q162 = 0, \"-\",IF(Rep_Data!Q162 = \"\",\"-\",Rep_Data!Q162))","v":"-"},{"$f":"IF(Rep_Data!R162 = 0, \"-\",IF(Rep_Data!R162 = \"\",\"-\",Rep_Data!R162))","v":"-"},null,null,null,null,null,null,null,null,null,null,null,null,null,{"$f":"Table1[[#This Row],[Speciality]]&Table1[[#This Row],[Q1]]","v":"Surgery-"}]
[null,161,{"$f":"Rep_Data!A163","v":"MARISSA,  AMI"},{"$f":"Rep_Data!C163","v":"O59951"},{"$f":"Rep_Data!G163","v":"Springfield"},{"$f":"Rep_Data!H163","v":"MA"},{"$f":"Rep_Data!I163","v":"01115"},{"$f":"Rep_Data!J163","v":"GP"},{"$f":"IF(Rep_Data!N163 = 0, \"-\",IF(Rep_Data!N163 = \"\",\"-\",Rep_Data!N163))","v":"-"},{"$f":"IF(Rep_Data!O163 = 0, \"-\",IF(Rep_Data!O163 = \"\",\"-\",Rep_Data!O163))","v":"-"},{"$f":"IF(Rep_Data!P163 = 0, \"-\",IF(Rep_Data!P163 = \"\",\"-\",Rep_Data!P163))","v":"-"},{"$f":"IF(Rep_Data!Q163 = 0, \"-\",IF(Rep_Data!Q163 = \"\",\"-\",Rep_Data!Q163))","v":"-"},{"$f":"IF(Rep_Data!R163 = 0, \"-\",IF(Rep_Data!R163 = \"\",\"-\",Rep_Data!R163))","v":"-"},null,null,null,null,null,null,null,null,null,null,null,null,null,{"$f":"Table1[[#This Row],[Speciality]]&Table1[[#This Row],[Q1]]","v":"GP-"}]
[null,162,{"$f":"Rep_Data!A164","v":"MARK,  MY"},{"$f":"Rep_Data!C164","v":"O69651"},{"$f":"Rep_Data!G164","v":"Sugar Valley"},{"$f":"Rep_Data!H164","v":"GA"},{"$f":"Rep_Data!I164","v":"30746"},{"$f":"Rep_Data!J164","v":"Surgery"},{"$f":"IF(Rep_Data!N164 = 0, \"-\",IF(Rep_Data!N164 = \"\",\"-\",Rep_Data!N164))","v":"-"},{"$f":"IF(Rep_Data!O164 = 0, \"-\",IF(Rep_Data!O164 = \"\",\"-\",Rep_Data!O164))","v":"-"},{"$f":"IF(Rep_Data!P164 = 0, \"-\",IF(Rep_Data!P164 = \"\",\"-\",Rep_Data!P164))","v":"-"},{"$f":"IF(Rep_Data!Q164 = 0, \"-\",IF(Rep_Data!Q164 = \"\",\"-\",Rep_Data!Q164))","v":"-"},{"$f":"IF(Rep_Data!R164 = 0, \"-\",IF(Rep_Data!R164 = \"\",\"-\",Rep_Data!R164))","v":"-"},null,null,null,null,null,null,null,null,null,null,null,null,null,{"$f":"Table1[[#This Row],[Speciality]]&Table1[[#This Row],[Q1]]","v":"Surgery-"}]
[null,163,{"$f":"Rep_Data!A165","v":"MARLEN,  CASANDRA"},{"$f":"Rep_Data!C165","v":"O74877"},{"$f":"Rep_Data!G165","v":"Waltham"},{"$f":"Rep_Data!H165","v":"MA"},{"$f":"Rep_Data!I165","v":"02454"},{"$f":"Rep_Data!J165","v":"Surgery"},{"$f":"IF(Rep_Data!N165 = 0, \"-\",IF(Rep_Data!N165 = \"\",\"-\",Rep_Data!N165))","v":"-"},{"$f":"IF(Rep_Data!O165 = 0, \"-\",IF(Rep_Data!O165 = \"\",\"-\",Rep_Data!O165))","v":"-"},{"$f":"IF(Rep_Data!P165 = 0, \"-\",IF(Rep_Data!P165 = \"\",\"-\",Rep_Data!P165))","v":"-"},{"$f":"IF(Rep_Data!Q165 = 0, \"-\",IF(Rep_Data!Q165 = \"\",\"-\",Rep_Data!Q165))","v":"-"},{"$f":"IF(Rep_Data!R165 = 0, \"-\",IF(Rep_Data!R165 = \"\",\"-\",Rep_Data!R165))","v":"-"},null,null,null,null,null,null,null,null,null,null,null,null,null,{"$f":"Table1[[#This Row],[Speciality]]&Table1[[#This Row],[Q1]]","v":"Surgery-"}]
[null,164,{"$f":"Rep_Data!A166","v":"MARTHA,  DOVIE"},{"$f":"Rep_Data!C166","v":"O76446"},{"$f":"Rep_Data!G166","v":"Oklahoma City"},{"$f":"Rep_Data!H166","v":"OK"},{"$f":"Rep_Data!I166","v":"73108"},{"$f":"Rep_Data!J166","v":"Surgery"},{"$f":"IF(Rep_Data!N166 = 0, \"-\",IF(Rep_Data!N166 = \"\",\"-\",Rep_Data!N166))","v":"YES"},{"$f":"IF(Rep_Data!O166 = 0, \"-\",IF(Rep_Data!O166 = \"\",\"-\",Rep_Data!O166))","v":"5"},{"$f":"IF(Rep_Data!P166 = 0, \"-\",IF(Rep_Data!P166 = \"\",\"-\",Rep_Data!P166))","v":"NONE"},{"$f":"IF(Rep_Data!Q166 = 0, \"-\",IF(Rep_Data!Q166 = \"\",\"-\",Rep_Data!Q166))","v":"1"},{"$f":"IF(Rep_Data!R166 = 0, \"-\",IF(Rep_Data!R166 = \"\",\"-\",Rep_Data!R166))","v":"More than 2"},null,null,null,null,null,null,null,null,null,null,null,null,null,{"$f":"Table1[[#This Row],[Speciality]]&Table1[[#This Row],[Q1]]","v":"SurgeryYES"}]
[null,165,{"$f":"Rep_Data!A167","v":"MARY,  GEMMA"},{"$f":"Rep_Data!C167","v":"O50413"},{"$f":"Rep_Data!G167","v":"Pensacola"},{"$f":"Rep_Data!H167","v":"FL"},{"$f":"Rep_Data!I167","v":"32598"},{"$f":"Rep_Data!J167","v":"GP"},{"$f":"IF(Rep_Data!N167 = 0, \"-\",IF(Rep_Data!N167 = \"\",\"-\",Rep_Data!N167))","v":"-"},{"$f":"IF(Rep_Data!O167 = 0, \"-\",IF(Rep_Data!O167 = \"\",\"-\",Rep_Data!O167))","v":"-"},{"$f":"IF(Rep_Data!P167 = 0, \"-\",IF(Rep_Data!P167 = \"\",\"-\",Rep_Data!P167))","v":"-"},{"$f":"IF(Rep_Data!Q167 = 0, \"-\",IF(Rep_Data!Q167 = \"\",\"-\",Rep_Data!Q167))","v":"-"},{"$f":"IF(Rep_Data!R167 = 0, \"-\",IF(Rep_Data!R167 = \"\",\"-\",Rep_Data!R167))","v":"-"},null,null,null,null,null,null,null,null,null,null,null,null,null,{"$f":"Table1[[#This Row],[Speciality]]&Table1[[#This Row],[Q1]]","v":"GP-"}]
[null,166,{"$f":"Rep_Data!A168","v":"MARYETTA,  ARACELIS"},{"$f":"Rep_Data!C168","v":"O58940"},{"$f":"Rep_Data!G168","v":"Bayville"},{"$f":"Rep_Data!H168","v":"ME"},{"$f":"Rep_Data!I168","v":"04536"},{"$f":"Rep_Data!J168","v":"GP"},{"$f":"IF(Rep_Data!N168 = 0, \"-\",IF(Rep_Data!N168 = \"\",\"-\",Rep_Data!N168))","v":"-"},{"$f":"IF(Rep_Data!O168 = 0, \"-\",IF(Rep_Data!O168 = \"\",\"-\",Rep_Data!O168))","v":"-"},{"$f":"IF(Rep_Data!P168 = 0, \"-\",IF(Rep_Data!P168 = \"\",\"-\",Rep_Data!P168))","v":"-"},{"$f":"IF(Rep_Data!Q168 = 0, \"-\",IF(Rep_Data!Q168 = \"\",\"-\",Rep_Data!Q168))","v":"-"},{"$f":"IF(Rep_Data!R168 = 0, \"-\",IF(Rep_Data!R168 = \"\",\"-\",Rep_Data!R168))","v":"-"},null,null,null,null,null,null,null,null,null,null,null,null,null,{"$f":"Table1[[#This Row],[Speciality]]&Table1[[#This Row],[Q1]]","v":"GP-"}]
[null,167,{"$f":"Rep_Data!A169","v":"MAURICE,  KIRK"},{"$f":"Rep_Data!C169","v":"O67681"},{"$f":"Rep_Data!G169","v":"Coffee Springs"},{"$f":"Rep_Data!H169","v":"AL"},{"$f":"Rep_Data!I169","v":"36318"},{"$f":"Rep_Data!J169","v":"GP"},{"$f":"IF(Rep_Data!N169 = 0, \"-\",IF(Rep_Data!N169 = \"\",\"-\",Rep_Data!N169))","v":"-"},{"$f":"IF(Rep_Data!O169 = 0, \"-\",IF(Rep_Data!O169 = \"\",\"-\",Rep_Data!O169))","v":"-"},{"$f":"IF(Rep_Data!P169 = 0, \"-\",IF(Rep_Data!P169 = \"\",\"-\",Rep_Data!P169))","v":"-"},{"$f":"IF(Rep_Data!Q169 = 0, \"-\",IF(Rep_Data!Q169 = \"\",\"-\",Rep_Data!Q169))","v":"-"},{"$f":"IF(Rep_Data!R169 = 0, \"-\",IF(Rep_Data!R169 = \"\",\"-\",Rep_Data!R169))","v":"-"},null,null,null,null,null,null,null,null,null,null,null,null,null,{"$f":"Table1[[#This Row],[Speciality]]&Table1[[#This Row],[Q1]]","v":"GP-"}]
[null,168,{"$f":"Rep_Data!A170","v":"MCKENZIE,  MARILEE"},{"$f":"Rep_Data!C170","v":"O65237"},{"$f":"Rep_Data!G170","v":"Marston"},{"$f":"Rep_Data!H170","v":"NC"},{"$f":"Rep_Data!I170","v":"28363"},{"$f":"Rep_Data!J170","v":"GP"},{"$f":"IF(Rep_Data!N170 = 0, \"-\",IF(Rep_Data!N170 = \"\",\"-\",Rep_Data!N170))","v":"-"},{"$f":"IF(Rep_Data!O170 = 0, \"-\",IF(Rep_Data!O170 = \"\",\"-\",Rep_Data!O170))","v":"-"},{"$f":"IF(Rep_Data!P170 = 0, \"-\",IF(Rep_Data!P170 = \"\",\"-\",Rep_Data!P170))","v":"-"},{"$f":"IF(Rep_Data!Q170 = 0, \"-\",IF(Rep_Data!Q170 = \"\",\"-\",Rep_Data!Q170))","v":"-"},{"$f":"IF(Rep_Data!R170 = 0, \"-\",IF(Rep_Data!R170 = \"\",\"-\",Rep_Data!R170))","v":"-"},null,null,null,null,null,null,null,null,null,null,null,null,null,{"$f":"Table1[[#This Row],[Speciality]]&Table1[[#This Row],[Q1]]","v":"GP-"}]
[null,169,{"$f":"Rep_Data!A171","v":"MEGAN,  AYESHA"},{"$f":"Rep_Data!C171","v":"O65732"},{"$f":"Rep_Data!G171","v":"Dayton"},{"$f":"Rep_Data!H171","v":"OH"},{"$f":"Rep_Data!I171","v":"45459"},{"$f":"Rep_Data!J171","v":"Ortho"},{"$f":"IF(Rep_Data!N171 = 0, \"-\",IF(Rep_Data!N171 = \"\",\"-\",Rep_Data!N171))","v":"-"},{"$f":"IF(Rep_Data!O171 = 0, \"-\",IF(Rep_Data!O171 = \"\",\"-\",Rep_Data!O171))","v":"-"},{"$f":"IF(Rep_Data!P171 = 0, \"-\",IF(Rep_Data!P171 = \"\",\"-\",Rep_Data!P171))","v":"-"},{"$f":"IF(Rep_Data!Q171 = 0, \"-\",IF(Rep_Data!Q171 = \"\",\"-\",Rep_Data!Q171))","v":"-"},{"$f":"IF(Rep_Data!R171 = 0, \"-\",IF(Rep_Data!R171 = \"\",\"-\",Rep_Data!R171))","v":"-"},null,null,null,null,null,null,null,null,null,null,null,null,null,{"$f":"Table1[[#This Row],[Speciality]]&Table1[[#This Row],[Q1]]","v":"Ortho-"}]
[null,170,{"$f":"Rep_Data!A172","v":"MELIA,  WONDA"},{"$f":"Rep_Data!C172","v":"O70924"},{"$f":"Rep_Data!G172","v":"Presque Isle"},{"$f":"Rep_Data!H172","v":"MI"},{"$f":"Rep_Data!I172","v":"49777"},{"$f":"Rep_Data!J172","v":"Ortho"},{"$f":"IF(Rep_Data!N172 = 0, \"-\",IF(Rep_Data!N172 = \"\",\"-\",Rep_Data!N172))","v":"-"},{"$f":"IF(Rep_Data!O172 = 0, \"-\",IF(Rep_Data!O172 = \"\",\"-\",Rep_Data!O172))","v":"-"},{"$f":"IF(Rep_Data!P172 = 0, \"-\",IF(Rep_Data!P172 = \"\",\"-\",Rep_Data!P172))","v":"-"},{"$f":"IF(Rep_Data!Q172 = 0, \"-\",IF(Rep_Data!Q172 = \"\",\"-\",Rep_Data!Q172))","v":"-"},{"$f":"IF(Rep_Data!R172 = 0, \"-\",IF(Rep_Data!R172 = \"\",\"-\",Rep_Data!R172))","v":"-"},null,null,null,null,null,null,null,null,null,null,null,null,null,{"$f":"Table1[[#This Row],[Speciality]]&Table1[[#This Row],[Q1]]","v":"Ortho-"}]
[null,171,{"$f":"Rep_Data!A173","v":"MELISSA,  JOANE"},{"$f":"Rep_Data!C173","v":"O66805"},{"$f":"Rep_Data!G173","v":"Chickasha"},{"$f":"Rep_Data!H173","v":"OK"},{"$f":"Rep_Data!I173","v":"73023"},{"$f":"Rep_Data!J173","v":"Surgery"},{"$f":"IF(Rep_Data!N173 = 0, \"-\",IF(Rep_Data!N173 = \"\",\"-\",Rep_Data!N173))","v":"-"},{"$f":"IF(Rep_Data!O173 = 0, \"-\",IF(Rep_Data!O173 = \"\",\"-\",Rep_Data!O173))","v":"-"},{"$f":"IF(Rep_Data!P173 = 0, \"-\",IF(Rep_Data!P173 = \"\",\"-\",Rep_Data!P173))","v":"-"},{"$f":"IF(Rep_Data!Q173 = 0, \"-\",IF(Rep_Data!Q173 = \"\",\"-\",Rep_Data!Q173))","v":"-"},{"$f":"IF(Rep_Data!R173 = 0, \"-\",IF(Rep_Data!R173 = \"\",\"-\",Rep_Data!R173))","v":"-"},null,null,null,null,null,null,null,null,null,null,null,null,null,{"$f":"Table1[[#This Row],[Speciality]]&Table1[[#This Row],[Q1]]","v":"Surgery-"}]
[null,172,{"$f":"Rep_Data!A174","v":"MELLISSA,  MYRTLE"},{"$f":"Rep_Data!C174","v":"O50769"},{"$f":"Rep_Data!G174","v":"Itta Bena"},{"$f":"Rep_Data!H174","v":"MS"},{"$f":"Rep_Data!I174","v":"38941"},{"$f":"Rep_Data!J174","v":"GP"},{"$f":"IF(Rep_Data!N174 = 0, \"-\",IF(Rep_Data!N174 = \"\",\"-\",Rep_Data!N174))","v":"-"},{"$f":"IF(Rep_Data!O174 = 0, \"-\",IF(Rep_Data!O174 = \"\",\"-\",Rep_Data!O174))","v":"-"},{"$f":"IF(Rep_Data!P174 = 0, \"-\",IF(Rep_Data!P174 = \"\",\"-\",Rep_Data!P174))","v":"-"},{"$f":"IF(Rep_Data!Q174 = 0, \"-\",IF(Rep_Data!Q174 = \"\",\"-\",Rep_Data!Q174))","v":"-"},{"$f":"IF(Rep_Data!R174 = 0, \"-\",IF(Rep_Data!R174 = \"\",\"-\",Rep_Data!R174))","v":"-"},null,null,null,null,null,null,null,null,null,null,null,null,null,{"$f":"Table1[[#This Row],[Speciality]]&Table1[[#This Row],[Q1]]","v":"GP-"}]
[null,173,{"$f":"Rep_Data!A175","v":"MELVIN,  GENA"},{"$f":"Rep_Data!C175","v":"O56579"},{"$f":"Rep_Data!G175","v":"Tall Timbers"},{"$f":"Rep_Data!H175","v":"MD"},{"$f":"Rep_Data!I175","v":"20690"},{"$f":"Rep_Data!J175","v":"Surgery"},{"$f":"IF(Rep_Data!N175 = 0, \"-\",IF(Rep_Data!N175 = \"\",\"-\",Rep_Data!N175))","v":"-"},{"$f":"IF(Rep_Data!O175 = 0, \"-\",IF(Rep_Data!O175 = \"\",\"-\",Rep_Data!O175))","v":"-"},{"$f":"IF(Rep_Data!P175 = 0, \"-\",IF(Rep_Data!P175 = \"\",\"-\",Rep_Data!P175))","v":"-"},{"$f":"IF(Rep_Data!Q175 = 0, \"-\",IF(Rep_Data!Q175 = \"\",\"-\",Rep_Data!Q175))","v":"-"},{"$f":"IF(Rep_Data!R175 = 0, \"-\",IF(Rep_Data!R175 = \"\",\"-\",Rep_Data!R175))","v":"-"},null,null,null,null,null,null,null,null,null,null,null,null,null,{"$f":"Table1[[#This Row],[Speciality]]&Table1[[#This Row],[Q1]]","v":"Surgery-"}]
[null,174,{"$f":"Rep_Data!A176","v":"MERILYN,  LENNY"},{"$f":"Rep_Data!C176","v":"O59301"},{"$f":"Rep_Data!G176","v":"Levering"},{"$f":"Rep_Data!H176","v":"MI"},{"$f":"Rep_Data!I176","v":"49755"},{"$f":"Rep_Data!J176","v":"GP"},{"$f":"IF(Rep_Data!N176 = 0, \"-\",IF(Rep_Data!N176 = \"\",\"-\",Rep_Data!N176))","v":"-"},{"$f":"IF(Rep_Data!O176 = 0, \"-\",IF(Rep_Data!O176 = \"\",\"-\",Rep_Data!O176))","v":"-"},{"$f":"IF(Rep_Data!P176 = 0, \"-\",IF(Rep_Data!P176 = \"\",\"-\",Rep_Data!P176))","v":"-"},{"$f":"IF(Rep_Data!Q176 = 0, \"-\",IF(Rep_Data!Q176 = \"\",\"-\",Rep_Data!Q176))","v":"-"},{"$f":"IF(Rep_Data!R176 = 0, \"-\",IF(Rep_Data!R176 = \"\",\"-\",Rep_Data!R176))","v":"-"},null,null,null,null,null,null,null,null,null,null,null,null,null,{"$f":"Table1[[#This Row],[Speciality]]&Table1[[#This Row],[Q1]]","v":"GP-"}]
[null,175,{"$f":"Rep_Data!A177","v":"MICHA,  LOURA"},{"$f":"Rep_Data!C177","v":"O63045"},{"$f":"Rep_Data!G177","v":"Sacramento"},{"$f":"Rep_Data!H177","v":"CA"},{"$f":"Rep_Data!I177","v":"94289"},{"$f":"Rep_Data!J177","v":"Ortho"},{"$f":"IF(Rep_Data!N177 = 0, \"-\",IF(Rep_Data!N177 = \"\",\"-\",Rep_Data!N177))","v":"-"},{"$f":"IF(Rep_Data!O177 = 0, \"-\",IF(Rep_Data!O177 = \"\",\"-\",Rep_Data!O177))","v":"-"},{"$f":"IF(Rep_Data!P177 = 0, \"-\",IF(Rep_Data!P177 = \"\",\"-\",Rep_Data!P177))","v":"-"},{"$f":"IF(Rep_Data!Q177 = 0, \"-\",IF(Rep_Data!Q177 = \"\",\"-\",Rep_Data!Q177))","v":"-"},{"$f":"IF(Rep_Data!R177 = 0, \"-\",IF(Rep_Data!R177 = \"\",\"-\",Rep_Data!R177))","v":"-"},null,null,null,null,null,null,null,null,null,null,null,null,null,{"$f":"Table1[[#This Row],[Speciality]]&Table1[[#This Row],[Q1]]","v":"Ortho-"}]
[null,176,{"$f":"Rep_Data!A178","v":"MICHAL,  EVITA"},{"$f":"Rep_Data!C178","v":"O69416"},{"$f":"Rep_Data!G178","v":"Monticello"},{"$f":"Rep_Data!H178","v":"FL"},{"$f":"Rep_Data!I178","v":"32345"},{"$f":"Rep_Data!J178","v":"Ortho"},{"$f":"IF(Rep_Data!N178 = 0, \"-\",IF(Rep_Data!N178 = \"\",\"-\",Rep_Data!N178))","v":"-"},{"$f":"IF(Rep_Data!O178 = 0, \"-\",IF(Rep_Data!O178 = \"\",\"-\",Rep_Data!O178))","v":"-"},{"$f":"IF(Rep_Data!P178 = 0, \"-\",IF(Rep_Data!P178 = \"\",\"-\",Rep_Data!P178))","v":"-"},{"$f":"IF(Rep_Data!Q178 = 0, \"-\",IF(Rep_Data!Q178 = \"\",\"-\",Rep_Data!Q178))","v":"-"},{"$f":"IF(Rep_Data!R178 = 0, \"-\",IF(Rep_Data!R178 = \"\",\"-\",Rep_Data!R178))","v":"-"},null,null,null,null,null,null,null,null,null,null,null,null,null,{"$f":"Table1[[#This Row],[Speciality]]&Table1[[#This Row],[Q1]]","v":"Ortho-"}]
[null,177,{"$f":"Rep_Data!A179","v":"MIGNON,  FELICIA"},{"$f":"Rep_Data!C179","v":"O72558"},{"$f":"Rep_Data!G179","v":"Sioux Falls"},{"$f":"Rep_Data!H179","v":"SD"},{"$f":"Rep_Data!I179","v":"57105"},{"$f":"Rep_Data!J179","v":"GP"},{"$f":"IF(Rep_Data!N179 = 0, \"-\",IF(Rep_Data!N179 = \"\",\"-\",Rep_Data!N179))","v":"YES"},{"$f":"IF(Rep_Data!O179 = 0, \"-\",IF(Rep_Data!O179 = \"\",\"-\",Rep_Data!O179))","v":"1 - 2"},{"$f":"IF(Rep_Data!P179 = 0, \"-\",IF(Rep_Data!P179 = \"\",\"-\",Rep_Data!P179))","v":"NONE"},{"$f":"IF(Rep_Data!Q179 = 0, \"-\",IF(Rep_Data!Q179 = \"\",\"-\",Rep_Data!Q179))","v":"1"},{"$f":"IF(Rep_Data!R179 = 0, \"-\",IF(Rep_Data!R179 = \"\",\"-\",Rep_Data!R179))","v":"2 or Less"},null,null,null,null,null,null,null,null,null,null,null,null,null,{"$f":"Table1[[#This Row],[Speciality]]&Table1[[#This Row],[Q1]]","v":"GPYES"}]
[null,178,{"$f":"Rep_Data!A180","v":"MITCHELL,  MOZELLA"},{"$f":"Rep_Data!C180","v":"O75619"},{"$f":"Rep_Data!G180","v":"Palm Bay"},{"$f":"Rep_Data!H180","v":"FL"},{"$f":"Rep_Data!I180","v":"32911"},{"$f":"Rep_Data!J180","v":"Ortho"},{"$f":"IF(Rep_Data!N180 = 0, \"-\",IF(Rep_Data!N180 = \"\",\"-\",Rep_Data!N180))","v":"YES"},{"$f":"IF(Rep_Data!O180 = 0, \"-\",IF(Rep_Data!O180 = \"\",\"-\",Rep_Data!O180))","v":"1 - 2"},{"$f":"IF(Rep_Data!P180 = 0, \"-\",IF(Rep_Data!P180 = \"\",\"-\",Rep_Data!P180))","v":"NONE"},{"$f":"IF(Rep_Data!Q180 = 0, \"-\",IF(Rep_Data!Q180 = \"\",\"-\",Rep_Data!Q180))","v":"1"},{"$f":"IF(Rep_Data!R180 = 0, \"-\",IF(Rep_Data!R180 = \"\",\"-\",Rep_Data!R180))","v":"2 or Less"},null,null,null,null,null,null,null,null,null,null,null,null,null,{"$f":"Table1[[#This Row],[Speciality]]&Table1[[#This Row],[Q1]]","v":"OrthoYES"}]
[null,179,{"$f":"Rep_Data!A181","v":"MITSUKO,  LATOSHA"},{"$f":"Rep_Data!C181","v":"O74997"},{"$f":"Rep_Data!G181","v":"Grayland"},{"$f":"Rep_Data!H181","v":"WA"},{"$f":"Rep_Data!I181","v":"98547"},{"$f":"Rep_Data!J181","v":"GP"},{"$f":"IF(Rep_Data!N181 = 0, \"-\",IF(Rep_Data!N181 = \"\",\"-\",Rep_Data!N181))","v":"-"},{"$f":"IF(Rep_Data!O181 = 0, \"-\",IF(Rep_Data!O181 = \"\",\"-\",Rep_Data!O181))","v":"-"},{"$f":"IF(Rep_Data!P181 = 0, \"-\",IF(Rep_Data!P181 = \"\",\"-\",Rep_Data!P181))","v":"-"},{"$f":"IF(Rep_Data!Q181 = 0, \"-\",IF(Rep_Data!Q181 = \"\",\"-\",Rep_Data!Q181))","v":"-"},{"$f":"IF(Rep_Data!R181 = 0, \"-\",IF(Rep_Data!R181 = \"\",\"-\",Rep_Data!R181))","v":"-"},null,null,null,null,null,null,null,null,null,null,null,null,null,{"$f":"Table1[[#This Row],[Speciality]]&Table1[[#This Row],[Q1]]","v":"GP-"}]
[null,180,{"$f":"Rep_Data!A182","v":"MODESTO,  VIRGILIO"},{"$f":"Rep_Data!C182","v":"O56879"},{"$f":"Rep_Data!G182","v":"Steeleville"},{"$f":"Rep_Data!H182","v":"IL"},{"$f":"Rep_Data!I182","v":"62288"},{"$f":"Rep_Data!J182","v":"GP"},{"$f":"IF(Rep_Data!N182 = 0, \"-\",IF(Rep_Data!N182 = \"\",\"-\",Rep_Data!N182))","v":"-"},{"$f":"IF(Rep_Data!O182 = 0, \"-\",IF(Rep_Data!O182 = \"\",\"-\",Rep_Data!O182))","v":"-"},{"$f":"IF(Rep_Data!P182 = 0, \"-\",IF(Rep_Data!P182 = \"\",\"-\",Rep_Data!P182))","v":"-"},{"$f":"IF(Rep_Data!Q182 = 0, \"-\",IF(Rep_Data!Q182 = \"\",\"-\",Rep_Data!Q182))","v":"-"},{"$f":"IF(Rep_Data!R182 = 0, \"-\",IF(Rep_Data!R182 = \"\",\"-\",Rep_Data!R182))","v":"-"},null,null,null,null,null,null,null,null,null,null,null,null,null,{"$f":"Table1[[#This Row],[Speciality]]&Table1[[#This Row],[Q1]]","v":"GP-"}]
[null,181,{"$f":"Rep_Data!A183","v":"NAKISHA,  BRETT"},{"$f":"Rep_Data!C183","v":"O75346"},{"$f":"Rep_Data!G183","v":"Bella Vista"},{"$f":"Rep_Data!H183","v":"CA"},{"$f":"Rep_Data!I183","v":"96008"},{"$f":"Rep_Data!J183","v":"GP"},{"$f":"IF(Rep_Data!N183 = 0, \"-\",IF(Rep_Data!N183 = \"\",\"-\",Rep_Data!N183))","v":"-"},{"$f":"IF(Rep_Data!O183 = 0, \"-\",IF(Rep_Data!O183 = \"\",\"-\",Rep_Data!O183))","v":"-"},{"$f":"IF(Rep_Data!P183 = 0, \"-\",IF(Rep_Data!P183 = \"\",\"-\",Rep_Data!P183))","v":"-"},{"$f":"IF(Rep_Data!Q183 = 0, \"-\",IF(Rep_Data!Q183 = \"\",\"-\",Rep_Data!Q183))","v":"-"},{"$f":"IF(Rep_Data!R183 = 0, \"-\",IF(Rep_Data!R183 = \"\",\"-\",Rep_Data!R183))","v":"-"},null,null,null,null,null,null,null,null,null,null,null,null,null,{"$f":"Table1[[#This Row],[Speciality]]&Table1[[#This Row],[Q1]]","v":"GP-"}]
[null,182,{"$f":"Rep_Data!A184","v":"NICHOLAS,  IONE"},{"$f":"Rep_Data!C184","v":"O77873"},{"$f":"Rep_Data!G184","v":"Shokan"},{"$f":"Rep_Data!H184","v":"NY"},{"$f":"Rep_Data!I184","v":"12481"},{"$f":"Rep_Data!J184","v":"GP"},{"$f":"IF(Rep_Data!N184 = 0, \"-\",IF(Rep_Data!N184 = \"\",\"-\",Rep_Data!N184))","v":"-"},{"$f":"IF(Rep_Data!O184 = 0, \"-\",IF(Rep_Data!O184 = \"\",\"-\",Rep_Data!O184))","v":"-"},{"$f":"IF(Rep_Data!P184 = 0, \"-\",IF(Rep_Data!P184 = \"\",\"-\",Rep_Data!P184))","v":"-"},{"$f":"IF(Rep_Data!Q184 = 0, \"-\",IF(Rep_Data!Q184 = \"\",\"-\",Rep_Data!Q184))","v":"-"},{"$f":"IF(Rep_Data!R184 = 0, \"-\",IF(Rep_Data!R184 = \"\",\"-\",Rep_Data!R184))","v":"-"},null,null,null,null,null,null,null,null,null,null,null,null,null,{"$f":"Table1[[#This Row],[Speciality]]&Table1[[#This Row],[Q1]]","v":"GP-"}]
[null,183,{"$f":"Rep_Data!A185","v":"OK,  DONOVAN"},{"$f":"Rep_Data!C185","v":"O75848"},{"$f":"Rep_Data!G185","v":"Blacksburg"},{"$f":"Rep_Data!H185","v":"VA"},{"$f":"Rep_Data!I185","v":"24060"},{"$f":"Rep_Data!J185","v":"GP"},{"$f":"IF(Rep_Data!N185 = 0, \"-\",IF(Rep_Data!N185 = \"\",\"-\",Rep_Data!N185))","v":"-"},{"$f":"IF(Rep_Data!O185 = 0, \"-\",IF(Rep_Data!O185 = \"\",\"-\",Rep_Data!O185))","v":"-"},{"$f":"IF(Rep_Data!P185 = 0, \"-\",IF(Rep_Data!P185 = \"\",\"-\",Rep_Data!P185))","v":"-"},{"$f":"IF(Rep_Data!Q185 = 0, \"-\",IF(Rep_Data!Q185 = \"\",\"-\",Rep_Data!Q185))","v":"-"},{"$f":"IF(Rep_Data!R185 = 0, \"-\",IF(Rep_Data!R185 = \"\",\"-\",Rep_Data!R185))","v":"-"},null,null,null,null,null,null,null,null,null,null,null,null,null,{"$f":"Table1[[#This Row],[Speciality]]&Table1[[#This Row],[Q1]]","v":"GP-"}]
[null,184,{"$f":"Rep_Data!A186","v":"OPAL,  JERICA"},{"$f":"Rep_Data!C186","v":"O77215"},{"$f":"Rep_Data!G186","v":"Flossmoor"},{"$f":"Rep_Data!H186","v":"IL"},{"$f":"Rep_Data!I186","v":"60422"},{"$f":"Rep_Data!J186","v":"GP"},{"$f":"IF(Rep_Data!N186 = 0, \"-\",IF(Rep_Data!N186 = \"\",\"-\",Rep_Data!N186))","v":"-"},{"$f":"IF(Rep_Data!O186 = 0, \"-\",IF(Rep_Data!O186 = \"\",\"-\",Rep_Data!O186))","v":"-"},{"$f":"IF(Rep_Data!P186 = 0, \"-\",IF(Rep_Data!P186 = \"\",\"-\",Rep_Data!P186))","v":"-"},{"$f":"IF(Rep_Data!Q186 = 0, \"-\",IF(Rep_Data!Q186 = \"\",\"-\",Rep_Data!Q186))","v":"-"},{"$f":"IF(Rep_Data!R186 = 0, \"-\",IF(Rep_Data!R186 = \"\",\"-\",Rep_Data!R186))","v":"-"},null,null,null,null,null,null,null,null,null,null,null,null,null,{"$f":"Table1[[#This Row],[Speciality]]&Table1[[#This Row],[Q1]]","v":"GP-"}]
[null,185,{"$f":"Rep_Data!A187","v":"PARIS,  ANGELE"},{"$f":"Rep_Data!C187","v":"O77382"},{"$f":"Rep_Data!G187","v":"Mendenhall"},{"$f":"Rep_Data!H187","v":"PA"},{"$f":"Rep_Data!I187","v":"19357"},{"$f":"Rep_Data!J187","v":"GP"},{"$f":"IF(Rep_Data!N187 = 0, \"-\",IF(Rep_Data!N187 = \"\",\"-\",Rep_Data!N187))","v":"-"},{"$f":"IF(Rep_Data!O187 = 0, \"-\",IF(Rep_Data!O187 = \"\",\"-\",Rep_Data!O187))","v":"-"},{"$f":"IF(Rep_Data!P187 = 0, \"-\",IF(Rep_Data!P187 = \"\",\"-\",Rep_Data!P187))","v":"-"},{"$f":"IF(Rep_Data!Q187 = 0, \"-\",IF(Rep_Data!Q187 = \"\",\"-\",Rep_Data!Q187))","v":"-"},{"$f":"IF(Rep_Data!R187 = 0, \"-\",IF(Rep_Data!R187 = \"\",\"-\",Rep_Data!R187))","v":"-"},null,null,null,null,null,null,null,null,null,null,null,null,null,{"$f":"Table1[[#This Row],[Speciality]]&Table1[[#This Row],[Q1]]","v":"GP-"}]
[null,186,{"$f":"Rep_Data!A188","v":"PAT,  BECKI"},{"$f":"Rep_Data!C188","v":"O56548"},{"$f":"Rep_Data!G188","v":"South Barre"},{"$f":"Rep_Data!H188","v":"MA"},{"$f":"Rep_Data!I188","v":"01074"},{"$f":"Rep_Data!J188","v":"GP"},{"$f":"IF(Rep_Data!N188 = 0, \"-\",IF(Rep_Data!N188 = \"\",\"-\",Rep_Data!N188))","v":"-"},{"$f":"IF(Rep_Data!O188 = 0, \"-\",IF(Rep_Data!O188 = \"\",\"-\",Rep_Data!O188))","v":"-"},{"$f":"IF(Rep_Data!P188 = 0, \"-\",IF(Rep_Data!P188 = \"\",\"-\",Rep_Data!P188))","v":"-"},{"$f":"IF(Rep_Data!Q188 = 0, \"-\",IF(Rep_Data!Q188 = \"\",\"-\",Rep_Data!Q188))","v":"-"},{"$f":"IF(Rep_Data!R188 = 0, \"-\",IF(Rep_Data!R188 = \"\",\"-\",Rep_Data!R188))","v":"-"},null,null,null,null,null,null,null,null,null,null,null,null,null,{"$f":"Table1[[#This Row],[Speciality]]&Table1[[#This Row],[Q1]]","v":"GP-"}]
[null,187,{"$f":"Rep_Data!A189","v":"PATTI,  OSCAR"},{"$f":"Rep_Data!C189","v":"O77476"},{"$f":"Rep_Data!G189","v":"Dickerson Run"},{"$f":"Rep_Data!H189","v":"PA"},{"$f":"Rep_Data!I189","v":"15430"},{"$f":"Rep_Data!J189","v":"GP"},{"$f":"IF(Rep_Data!N189 = 0, \"-\",IF(Rep_Data!N189 = \"\",\"-\",Rep_Data!N189))","v":"-"},{"$f":"IF(Rep_Data!O189 = 0, \"-\",IF(Rep_Data!O189 = \"\",\"-\",Rep_Data!O189))","v":"-"},{"$f":"IF(Rep_Data!P189 = 0, \"-\",IF(Rep_Data!P189 = \"\",\"-\",Rep_Data!P189))","v":"-"},{"$f":"IF(Rep_Data!Q189 = 0, \"-\",IF(Rep_Data!Q189 = \"\",\"-\",Rep_Data!Q189))","v":"-"},{"$f":"IF(Rep_Data!R189 = 0, \"-\",IF(Rep_Data!R189 = \"\",\"-\",Rep_Data!R189))","v":"-"},null,null,null,null,null,null,null,null,null,null,null,null,null,{"$f":"Table1[[#This Row],[Speciality]]&Table1[[#This Row],[Q1]]","v":"GP-"}]
[null,188,{"$f":"Rep_Data!A190","v":"PAUL,  MARSHALL"},{"$f":"Rep_Data!C190","v":"O64022"},{"$f":"Rep_Data!G190","v":"Sewanee"},{"$f":"Rep_Data!H190","v":"TN"},{"$f":"Rep_Data!I190","v":"37383"},{"$f":"Rep_Data!J190","v":"Ortho"},{"$f":"IF(Rep_Data!N190 = 0, \"-\",IF(Rep_Data!N190 = \"\",\"-\",Rep_Data!N190))","v":"-"},{"$f":"IF(Rep_Data!O190 = 0, \"-\",IF(Rep_Data!O190 = \"\",\"-\",Rep_Data!O190))","v":"-"},{"$f":"IF(Rep_Data!P190 = 0, \"-\",IF(Rep_Data!P190 = \"\",\"-\",Rep_Data!P190))","v":"-"},{"$f":"IF(Rep_Data!Q190 = 0, \"-\",IF(Rep_Data!Q190 = \"\",\"-\",Rep_Data!Q190))","v":"-"},{"$f":"IF(Rep_Data!R190 = 0, \"-\",IF(Rep_Data!R190 = \"\",\"-\",Rep_Data!R190))","v":"-"},null,null,null,null,null,null,null,null,null,null,null,null,null,{"$f":"Table1[[#This Row],[Speciality]]&Table1[[#This Row],[Q1]]","v":"Ortho-"}]
[null,189,{"$f":"Rep_Data!A191","v":"PAULA,  GAY"},{"$f":"Rep_Data!C191","v":"O79857"},{"$f":"Rep_Data!G191","v":"Gregory"},{"$f":"Rep_Data!H191","v":"TX"},{"$f":"Rep_Data!I191","v":"78359"},{"$f":"Rep_Data!J191","v":"GP"},{"$f":"IF(Rep_Data!N191 = 0, \"-\",IF(Rep_Data!N191 = \"\",\"-\",Rep_Data!N191))","v":"-"},{"$f":"IF(Rep_Data!O191 = 0, \"-\",IF(Rep_Data!O191 = \"\",\"-\",Rep_Data!O191))","v":"-"},{"$f":"IF(Rep_Data!P191 = 0, \"-\",IF(Rep_Data!P191 = \"\",\"-\",Rep_Data!P191))","v":"-"},{"$f":"IF(Rep_Data!Q191 = 0, \"-\",IF(Rep_Data!Q191 = \"\",\"-\",Rep_Data!Q191))","v":"-"},{"$f":"IF(Rep_Data!R191 = 0, \"-\",IF(Rep_Data!R191 = \"\",\"-\",Rep_Data!R191))","v":"-"},null,null,null,null,null,null,null,null,null,null,null,null,null,{"$f":"Table1[[#This Row],[Speciality]]&Table1[[#This Row],[Q1]]","v":"GP-"}]
[null,190,{"$f":"Rep_Data!A192","v":"PETRINA,  PHYLIS"},{"$f":"Rep_Data!C192","v":"O55090"},{"$f":"Rep_Data!G192","v":"Beckley"},{"$f":"Rep_Data!H192","v":"WV"},{"$f":"Rep_Data!I192","v":"25802"},{"$f":"Rep_Data!J192","v":"Surgery"},{"$f":"IF(Rep_Data!N192 = 0, \"-\",IF(Rep_Data!N192 = \"\",\"-\",Rep_Data!N192))","v":"-"},{"$f":"IF(Rep_Data!O192 = 0, \"-\",IF(Rep_Data!O192 = \"\",\"-\",Rep_Data!O192))","v":"-"},{"$f":"IF(Rep_Data!P192 = 0, \"-\",IF(Rep_Data!P192 = \"\",\"-\",Rep_Data!P192))","v":"-"},{"$f":"IF(Rep_Data!Q192 = 0, \"-\",IF(Rep_Data!Q192 = \"\",\"-\",Rep_Data!Q192))","v":"-"},{"$f":"IF(Rep_Data!R192 = 0, \"-\",IF(Rep_Data!R192 = \"\",\"-\",Rep_Data!R192))","v":"-"},null,null,null,null,null,null,null,null,null,null,null,null,null,{"$f":"Table1[[#This Row],[Speciality]]&Table1[[#This Row],[Q1]]","v":"Surgery-"}]
[null,191,{"$f":"Rep_Data!A193","v":"PHYLISS,  CONNIE"},{"$f":"Rep_Data!C193","v":"O63455"},{"$f":"Rep_Data!G193","v":"Onslow"},{"$f":"Rep_Data!H193","v":"IA"},{"$f":"Rep_Data!I193","v":"52321"},{"$f":"Rep_Data!J193","v":"GP"},{"$f":"IF(Rep_Data!N193 = 0, \"-\",IF(Rep_Data!N193 = \"\",\"-\",Rep_Data!N193))","v":"-"},{"$f":"IF(Rep_Data!O193 = 0, \"-\",IF(Rep_Data!O193 = \"\",\"-\",Rep_Data!O193))","v":"-"},{"$f":"IF(Rep_Data!P193 = 0, \"-\",IF(Rep_Data!P193 = \"\",\"-\",Rep_Data!P193))","v":"-"},{"$f":"IF(Rep_Data!Q193 = 0, \"-\",IF(Rep_Data!Q193 = \"\",\"-\",Rep_Data!Q193))","v":"-"},{"$f":"IF(Rep_Data!R193 = 0, \"-\",IF(Rep_Data!R193 = \"\",\"-\",Rep_Data!R193))","v":"-"},null,null,null,null,null,null,null,null,null,null,null,null,null,{"$f":"Table1[[#This Row],[Speciality]]&Table1[[#This Row],[Q1]]","v":"GP-"}]
[null,192,{"$f":"Rep_Data!A194","v":"PRESTON,  JOHANNE"},{"$f":"Rep_Data!C194","v":"O64535"},{"$f":"Rep_Data!G194","v":"Glen Oaks"},{"$f":"Rep_Data!H194","v":"NY"},{"$f":"Rep_Data!I194","v":"11004"},{"$f":"Rep_Data!J194","v":"GP"},{"$f":"IF(Rep_Data!N194 = 0, \"-\",IF(Rep_Data!N194 = \"\",\"-\",Rep_Data!N194))","v":"-"},{"$f":"IF(Rep_Data!O194 = 0, \"-\",IF(Rep_Data!O194 = \"\",\"-\",Rep_Data!O194))","v":"-"},{"$f":"IF(Rep_Data!P194 = 0, \"-\",IF(Rep_Data!P194 = \"\",\"-\",Rep_Data!P194))","v":"-"},{"$f":"IF(Rep_Data!Q194 = 0, \"-\",IF(Rep_Data!Q194 = \"\",\"-\",Rep_Data!Q194))","v":"-"},{"$f":"IF(Rep_Data!R194 = 0, \"-\",IF(Rep_Data!R194 = \"\",\"-\",Rep_Data!R194))","v":"-"},null,null,null,null,null,null,null,null,null,null,null,null,null,{"$f":"Table1[[#This Row],[Speciality]]&Table1[[#This Row],[Q1]]","v":"GP-"}]
[null,193,{"$f":"Rep_Data!A195","v":"PRISCILLA,  ANDRA"},{"$f":"Rep_Data!C195","v":"O69710"},{"$f":"Rep_Data!G195","v":"Kirwin"},{"$f":"Rep_Data!H195","v":"KS"},{"$f":"Rep_Data!I195","v":"67644"},{"$f":"Rep_Data!J195","v":"GP"},{"$f":"IF(Rep_Data!N195 = 0, \"-\",IF(Rep_Data!N195 = \"\",\"-\",Rep_Data!N195))","v":"-"},{"$f":"IF(Rep_Data!O195 = 0, \"-\",IF(Rep_Data!O195 = \"\",\"-\",Rep_Data!O195))","v":"-"},{"$f":"IF(Rep_Data!P195 = 0, \"-\",IF(Rep_Data!P195 = \"\",\"-\",Rep_Data!P195))","v":"-"},{"$f":"IF(Rep_Data!Q195 = 0, \"-\",IF(Rep_Data!Q195 = \"\",\"-\",Rep_Data!Q195))","v":"-"},{"$f":"IF(Rep_Data!R195 = 0, \"-\",IF(Rep_Data!R195 = \"\",\"-\",Rep_Data!R195))","v":"-"},null,null,null,null,null,null,null,null,null,null,null,null,null,{"$f":"Table1[[#This Row],[Speciality]]&Table1[[#This Row],[Q1]]","v":"GP-"}]
[null,194,{"$f":"Rep_Data!A196","v":"QIANA,  LORA"},{"$f":"Rep_Data!C196","v":"O79994"},{"$f":"Rep_Data!G196","v":"Vienna"},{"$f":"Rep_Data!H196","v":"VA"},{"$f":"Rep_Data!I196","v":"22180"},{"$f":"Rep_Data!J196","v":"GP"},{"$f":"IF(Rep_Data!N196 = 0, \"-\",IF(Rep_Data!N196 = \"\",\"-\",Rep_Data!N196))","v":"-"},{"$f":"IF(Rep_Data!O196 = 0, \"-\",IF(Rep_Data!O196 = \"\",\"-\",Rep_Data!O196))","v":"-"},{"$f":"IF(Rep_Data!P196 = 0, \"-\",IF(Rep_Data!P196 = \"\",\"-\",Rep_Data!P196))","v":"-"},{"$f":"IF(Rep_Data!Q196 = 0, \"-\",IF(Rep_Data!Q196 = \"\",\"-\",Rep_Data!Q196))","v":"-"},{"$f":"IF(Rep_Data!R196 = 0, \"-\",IF(Rep_Data!R196 = \"\",\"-\",Rep_Data!R196))","v":"-"},null,null,null,null,null,null,null,null,null,null,null,null,null,{"$f":"Table1[[#This Row],[Speciality]]&Table1[[#This Row],[Q1]]","v":"GP-"}]
[null,195,{"$f":"Rep_Data!A197","v":"RENATO,  JEANNETTA"},{"$f":"Rep_Data!C197","v":"O66775"},{"$f":"Rep_Data!G197","v":"Rocky Mount"},{"$f":"Rep_Data!H197","v":"NC"},{"$f":"Rep_Data!I197","v":"27804"},{"$f":"Rep_Data!J197","v":"Surgery"},{"$f":"IF(Rep_Data!N197 = 0, \"-\",IF(Rep_Data!N197 = \"\",\"-\",Rep_Data!N197))","v":"-"},{"$f":"IF(Rep_Data!O197 = 0, \"-\",IF(Rep_Data!O197 = \"\",\"-\",Rep_Data!O197))","v":"-"},{"$f":"IF(Rep_Data!P197 = 0, \"-\",IF(Rep_Data!P197 = \"\",\"-\",Rep_Data!P197))","v":"-"},{"$f":"IF(Rep_Data!Q197 = 0, \"-\",IF(Rep_Data!Q197 = \"\",\"-\",Rep_Data!Q197))","v":"-"},{"$f":"IF(Rep_Data!R197 = 0, \"-\",IF(Rep_Data!R197 = \"\",\"-\",Rep_Data!R197))","v":"-"},null,null,null,null,null,null,null,null,null,null,null,null,null,{"$f":"Table1[[#This Row],[Speciality]]&Table1[[#This Row],[Q1]]","v":"Surgery-"}]
[null,196,{"$f":"Rep_Data!A198","v":"RENAY,  FRANCENE"},{"$f":"Rep_Data!C198","v":"O52275"},{"$f":"Rep_Data!G198","v":"Minnetonka Beach"},{"$f":"Rep_Data!H198","v":"MN"},{"$f":"Rep_Data!I198","v":"55361"},{"$f":"Rep_Data!J198","v":"Ortho"},{"$f":"IF(Rep_Data!N198 = 0, \"-\",IF(Rep_Data!N198 = \"\",\"-\",Rep_Data!N198))","v":"-"},{"$f":"IF(Rep_Data!O198 = 0, \"-\",IF(Rep_Data!O198 = \"\",\"-\",Rep_Data!O198))","v":"-"},{"$f":"IF(Rep_Data!P198 = 0, \"-\",IF(Rep_Data!P198 = \"\",\"-\",Rep_Data!P198))","v":"-"},{"$f":"IF(Rep_Data!Q198 = 0, \"-\",IF(Rep_Data!Q198 = \"\",\"-\",Rep_Data!Q198))","v":"-"},{"$f":"IF(Rep_Data!R198 = 0, \"-\",IF(Rep_Data!R198 = \"\",\"-\",Rep_Data!R198))","v":"-"},null,null,null,null,null,null,null,null,null,null,null,null,null,{"$f":"Table1[[#This Row],[Speciality]]&Table1[[#This Row],[Q1]]","v":"Ortho-"}]
[null,197,{"$f":"Rep_Data!A199","v":"RIA,  JOSPHINE"},{"$f":"Rep_Data!C199","v":"O68628"},{"$f":"Rep_Data!G199","v":"Bellingham"},{"$f":"Rep_Data!H199","v":"MA"},{"$f":"Rep_Data!I199","v":"02019"},{"$f":"Rep_Data!J199","v":"GP"},{"$f":"IF(Rep_Data!N199 = 0, \"-\",IF(Rep_Data!N199 = \"\",\"-\",Rep_Data!N199))","v":"-"},{"$f":"IF(Rep_Data!O199 = 0, \"-\",IF(Rep_Data!O199 = \"\",\"-\",Rep_Data!O199))","v":"-"},{"$f":"IF(Rep_Data!P199 = 0, \"-\",IF(Rep_Data!P199 = \"\",\"-\",Rep_Data!P199))","v":"-"},{"$f":"IF(Rep_Data!Q199 = 0, \"-\",IF(Rep_Data!Q199 = \"\",\"-\",Rep_Data!Q199))","v":"-"},{"$f":"IF(Rep_Data!R199 = 0, \"-\",IF(Rep_Data!R199 = \"\",\"-\",Rep_Data!R199))","v":"-"},null,null,null,null,null,null,null,null,null,null,null,null,null,{"$f":"Table1[[#This Row],[Speciality]]&Table1[[#This Row],[Q1]]","v":"GP-"}]
[null,198,{"$f":"Rep_Data!A200","v":"RICKI,  SHERLEY"},{"$f":"Rep_Data!C200","v":"O76414"},{"$f":"Rep_Data!G200","v":"San Diego"},{"$f":"Rep_Data!H200","v":"CA"},{"$f":"Rep_Data!I200","v":"92116"},{"$f":"Rep_Data!J200","v":"Ortho"},{"$f":"IF(Rep_Data!N200 = 0, \"-\",IF(Rep_Data!N200 = \"\",\"-\",Rep_Data!N200))","v":"-"},{"$f":"IF(Rep_Data!O200 = 0, \"-\",IF(Rep_Data!O200 = \"\",\"-\",Rep_Data!O200))","v":"-"},{"$f":"IF(Rep_Data!P200 = 0, \"-\",IF(Rep_Data!P200 = \"\",\"-\",Rep_Data!P200))","v":"-"},{"$f":"IF(Rep_Data!Q200 = 0, \"-\",IF(Rep_Data!Q200 = \"\",\"-\",Rep_Data!Q200))","v":"-"},{"$f":"IF(Rep_Data!R200 = 0, \"-\",IF(Rep_Data!R200 = \"\",\"-\",Rep_Data!R200))","v":"-"},null,null,null,null,null,null,null,null,null,null,null,null,null,{"$f":"Table1[[#This Row],[Speciality]]&Table1[[#This Row],[Q1]]","v":"Ortho-"}]
[null,199,{"$f":"Rep_Data!A201","v":"ROD,  KENNY"},{"$f":"Rep_Data!C201","v":"O73212"},{"$f":"Rep_Data!G201","v":"Pine Grove"},{"$f":"Rep_Data!H201","v":"CA"},{"$f":"Rep_Data!I201","v":"95665"},{"$f":"Rep_Data!J201","v":"Surgery"},{"$f":"IF(Rep_Data!N201 = 0, \"-\",IF(Rep_Data!N201 = \"\",\"-\",Rep_Data!N201))","v":"-"},{"$f":"IF(Rep_Data!O201 = 0, \"-\",IF(Rep_Data!O201 = \"\",\"-\",Rep_Data!O201))","v":"-"},{"$f":"IF(Rep_Data!P201 = 0, \"-\",IF(Rep_Data!P201 = \"\",\"-\",Rep_Data!P201))","v":"-"},{"$f":"IF(Rep_Data!Q201 = 0, \"-\",IF(Rep_Data!Q201 = \"\",\"-\",Rep_Data!Q201))","v":"-"},{"$f":"IF(Rep_Data!R201 = 0, \"-\",IF(Rep_Data!R201 = \"\",\"-\",Rep_Data!R201))","v":"-"},null,null,null,null,null,null,null,null,null,null,null,null,null,{"$f":"Table1[[#This Row],[Speciality]]&Table1[[#This Row],[Q1]]","v":"Surgery-"}]
[null,200,{"$f":"Rep_Data!A202","v":"ROLANDO,  JANISE"},{"$f":"Rep_Data!C202","v":"O52775"},{"$f":"Rep_Data!G202","v":"West Dover"},{"$f":"Rep_Data!H202","v":"VT"},{"$f":"Rep_Data!I202","v":"05356"},{"$f":"Rep_Data!J202","v":"GP"},{"$f":"IF(Rep_Data!N202 = 0, \"-\",IF(Rep_Data!N202 = \"\",\"-\",Rep_Data!N202))","v":"-"},{"$f":"IF(Rep_Data!O202 = 0, \"-\",IF(Rep_Data!O202 = \"\",\"-\",Rep_Data!O202))","v":"-"},{"$f":"IF(Rep_Data!P202 = 0, \"-\",IF(Rep_Data!P202 = \"\",\"-\",Rep_Data!P202))","v":"-"},{"$f":"IF(Rep_Data!Q202 = 0, \"-\",IF(Rep_Data!Q202 = \"\",\"-\",Rep_Data!Q202))","v":"-"},{"$f":"IF(Rep_Data!R202 = 0, \"-\",IF(Rep_Data!R202 = \"\",\"-\",Rep_Data!R202))","v":"-"},null,null,null,null,null,null,null,null,null,null,null,null,null,{"$f":"Table1[[#This Row],[Speciality]]&Table1[[#This Row],[Q1]]","v":"GP-"}]
[null,201,{"$f":"Rep_Data!A203","v":"RONALD,  DANILLE"},{"$f":"Rep_Data!C203","v":"O51562"},{"$f":"Rep_Data!G203","v":"Lancaster"},{"$f":"Rep_Data!H203","v":"PA"},{"$f":"Rep_Data!I203","v":"17608"},{"$f":"Rep_Data!J203","v":"GP"},{"$f":"IF(Rep_Data!N203 = 0, \"-\",IF(Rep_Data!N203 = \"\",\"-\",Rep_Data!N203))","v":"-"},{"$f":"IF(Rep_Data!O203 = 0, \"-\",IF(Rep_Data!O203 = \"\",\"-\",Rep_Data!O203))","v":"-"},{"$f":"IF(Rep_Data!P203 = 0, \"-\",IF(Rep_Data!P203 = \"\",\"-\",Rep_Data!P203))","v":"-"},{"$f":"IF(Rep_Data!Q203 = 0, \"-\",IF(Rep_Data!Q203 = \"\",\"-\",Rep_Data!Q203))","v":"-"},{"$f":"IF(Rep_Data!R203 = 0, \"-\",IF(Rep_Data!R203 = \"\",\"-\",Rep_Data!R203))","v":"-"},null,null,null,null,null,null,null,null,null,null,null,null,null,{"$f":"Table1[[#This Row],[Speciality]]&Table1[[#This Row],[Q1]]","v":"GP-"}]
[null,202,{"$f":"Rep_Data!A204","v":"RONNA,  EDEN"},{"$f":"Rep_Data!C204","v":"O54106"},{"$f":"Rep_Data!G204","v":"Norwalk"},{"$f":"Rep_Data!H204","v":"CT"},{"$f":"Rep_Data!I204","v":"06858"},{"$f":"Rep_Data!J204","v":"GP"},{"$f":"IF(Rep_Data!N204 = 0, \"-\",IF(Rep_Data!N204 = \"\",\"-\",Rep_Data!N204))","v":"-"},{"$f":"IF(Rep_Data!O204 = 0, \"-\",IF(Rep_Data!O204 = \"\",\"-\",Rep_Data!O204))","v":"-"},{"$f":"IF(Rep_Data!P204 = 0, \"-\",IF(Rep_Data!P204 = \"\",\"-\",Rep_Data!P204))","v":"-"},{"$f":"IF(Rep_Data!Q204 = 0, \"-\",IF(Rep_Data!Q204 = \"\",\"-\",Rep_Data!Q204))","v":"-"},{"$f":"IF(Rep_Data!R204 = 0, \"-\",IF(Rep_Data!R204 = \"\",\"-\",Rep_Data!R204))","v":"-"},null,null,null,null,null,null,null,null,null,null,null,null,null,{"$f":"Table1[[#This Row],[Speciality]]&Table1[[#This Row],[Q1]]","v":"GP-"}]
[null,203,{"$f":"Rep_Data!A205","v":"ROSELINE,  ANGELINA"},{"$f":"Rep_Data!C205","v":"O57029"},{"$f":"Rep_Data!G205","v":"Thayne"},{"$f":"Rep_Data!H205","v":"WY"},{"$f":"Rep_Data!I205","v":"83127"},{"$f":"Rep_Data!J205","v":"GP"},{"$f":"IF(Rep_Data!N205 = 0, \"-\",IF(Rep_Data!N205 = \"\",\"-\",Rep_Data!N205))","v":"-"},{"$f":"IF(Rep_Data!O205 = 0, \"-\",IF(Rep_Data!O205 = \"\",\"-\",Rep_Data!O205))","v":"-"},{"$f":"IF(Rep_Data!P205 = 0, \"-\",IF(Rep_Data!P205 = \"\",\"-\",Rep_Data!P205))","v":"-"},{"$f":"IF(Rep_Data!Q205 = 0, \"-\",IF(Rep_Data!Q205 = \"\",\"-\",Rep_Data!Q205))","v":"-"},{"$f":"IF(Rep_Data!R205 = 0, \"-\",IF(Rep_Data!R205 = \"\",\"-\",Rep_Data!R205))","v":"-"},null,null,null,null,null,null,null,null,null,null,null,null,null,{"$f":"Table1[[#This Row],[Speciality]]&Table1[[#This Row],[Q1]]","v":"GP-"}]
[null,204,{"$f":"Rep_Data!A206","v":"ROSIE,  MADELINE"},{"$f":"Rep_Data!C206","v":"O63058"},{"$f":"Rep_Data!G206","v":"Louisville"},{"$f":"Rep_Data!H206","v":"GA"},{"$f":"Rep_Data!I206","v":"30434"},{"$f":"Rep_Data!J206","v":"GP"},{"$f":"IF(Rep_Data!N206 = 0, \"-\",IF(Rep_Data!N206 = \"\",\"-\",Rep_Data!N206))","v":"-"},{"$f":"IF(Rep_Data!O206 = 0, \"-\",IF(Rep_Data!O206 = \"\",\"-\",Rep_Data!O206))","v":"-"},{"$f":"IF(Rep_Data!P206 = 0, \"-\",IF(Rep_Data!P206 = \"\",\"-\",Rep_Data!P206))","v":"-"},{"$f":"IF(Rep_Data!Q206 = 0, \"-\",IF(Rep_Data!Q206 = \"\",\"-\",Rep_Data!Q206))","v":"-"},{"$f":"IF(Rep_Data!R206 = 0, \"-\",IF(Rep_Data!R206 = \"\",\"-\",Rep_Data!R206))","v":"-"},null,null,null,null,null,null,null,null,null,null,null,null,null,{"$f":"Table1[[#This Row],[Speciality]]&Table1[[#This Row],[Q1]]","v":"GP-"}]
[null,205,{"$f":"Rep_Data!A207","v":"ROYCE,  TAMMY"},{"$f":"Rep_Data!C207","v":"O65869"},{"$f":"Rep_Data!G207","v":"Points"},{"$f":"Rep_Data!H207","v":"WV"},{"$f":"Rep_Data!I207","v":"25437"},{"$f":"Rep_Data!J207","v":"Ortho"},{"$f":"IF(Rep_Data!N207 = 0, \"-\",IF(Rep_Data!N207 = \"\",\"-\",Rep_Data!N207))","v":"-"},{"$f":"IF(Rep_Data!O207 = 0, \"-\",IF(Rep_Data!O207 = \"\",\"-\",Rep_Data!O207))","v":"-"},{"$f":"IF(Rep_Data!P207 = 0, \"-\",IF(Rep_Data!P207 = \"\",\"-\",Rep_Data!P207))","v":"-"},{"$f":"IF(Rep_Data!Q207 = 0, \"-\",IF(Rep_Data!Q207 = \"\",\"-\",Rep_Data!Q207))","v":"-"},{"$f":"IF(Rep_Data!R207 = 0, \"-\",IF(Rep_Data!R207 = \"\",\"-\",Rep_Data!R207))","v":"-"},null,null,null,null,null,null,null,null,null,null,null,null,null,{"$f":"Table1[[#This Row],[Speciality]]&Table1[[#This Row],[Q1]]","v":"Ortho-"}]
[null,206,{"$f":"Rep_Data!A208","v":"RUEBEN,  DORLA"},{"$f":"Rep_Data!C208","v":"O60894"},{"$f":"Rep_Data!G208","v":"Esom Hill"},{"$f":"Rep_Data!H208","v":"GA"},{"$f":"Rep_Data!I208","v":"30138"},{"$f":"Rep_Data!J208","v":"Surgery"},{"$f":"IF(Rep_Data!N208 = 0, \"-\",IF(Rep_Data!N208 = \"\",\"-\",Rep_Data!N208))","v":"-"},{"$f":"IF(Rep_Data!O208 = 0, \"-\",IF(Rep_Data!O208 = \"\",\"-\",Rep_Data!O208))","v":"-"},{"$f":"IF(Rep_Data!P208 = 0, \"-\",IF(Rep_Data!P208 = \"\",\"-\",Rep_Data!P208))","v":"-"},{"$f":"IF(Rep_Data!Q208 = 0, \"-\",IF(Rep_Data!Q208 = \"\",\"-\",Rep_Data!Q208))","v":"-"},{"$f":"IF(Rep_Data!R208 = 0, \"-\",IF(Rep_Data!R208 = \"\",\"-\",Rep_Data!R208))","v":"-"},null,null,null,null,null,null,null,null,null,null,null,null,null,{"$f":"Table1[[#This Row],[Speciality]]&Table1[[#This Row],[Q1]]","v":"Surgery-"}]
[null,207,{"$f":"Rep_Data!A209","v":"RUTHE,  HILDEGARD"},{"$f":"Rep_Data!C209","v":"O67433"},{"$f":"Rep_Data!G209","v":"Bennington"},{"$f":"Rep_Data!H209","v":"IN"},{"$f":"Rep_Data!I209","v":"47011"},{"$f":"Rep_Data!J209","v":"GP"},{"$f":"IF(Rep_Data!N209 = 0, \"-\",IF(Rep_Data!N209 = \"\",\"-\",Rep_Data!N209))","v":"-"},{"$f":"IF(Rep_Data!O209 = 0, \"-\",IF(Rep_Data!O209 = \"\",\"-\",Rep_Data!O209))","v":"-"},{"$f":"IF(Rep_Data!P209 = 0, \"-\",IF(Rep_Data!P209 = \"\",\"-\",Rep_Data!P209))","v":"-"},{"$f":"IF(Rep_Data!Q209 = 0, \"-\",IF(Rep_Data!Q209 = \"\",\"-\",Rep_Data!Q209))","v":"-"},{"$f":"IF(Rep_Data!R209 = 0, \"-\",IF(Rep_Data!R209 = \"\",\"-\",Rep_Data!R209))","v":"-"},null,null,null,null,null,null,null,null,null,null,null,null,null,{"$f":"Table1[[#This Row],[Speciality]]&Table1[[#This Row],[Q1]]","v":"GP-"}]
[null,208,{"$f":"Rep_Data!A210","v":"SALINA,  CORINA"},{"$f":"Rep_Data!C210","v":"O63730"},{"$f":"Rep_Data!G210","v":"Phoenix"},{"$f":"Rep_Data!H210","v":"AZ"},{"$f":"Rep_Data!I210","v":"85080"},{"$f":"Rep_Data!J210","v":"Ortho"},{"$f":"IF(Rep_Data!N210 = 0, \"-\",IF(Rep_Data!N210 = \"\",\"-\",Rep_Data!N210))","v":"-"},{"$f":"IF(Rep_Data!O210 = 0, \"-\",IF(Rep_Data!O210 = \"\",\"-\",Rep_Data!O210))","v":"-"},{"$f":"IF(Rep_Data!P210 = 0, \"-\",IF(Rep_Data!P210 = \"\",\"-\",Rep_Data!P210))","v":"-"},{"$f":"IF(Rep_Data!Q210 = 0, \"-\",IF(Rep_Data!Q210 = \"\",\"-\",Rep_Data!Q210))","v":"-"},{"$f":"IF(Rep_Data!R210 = 0, \"-\",IF(Rep_Data!R210 = \"\",\"-\",Rep_Data!R210))","v":"-"},null,null,null,null,null,null,null,null,null,null,null,null,null,{"$f":"Table1[[#This Row],[Speciality]]&Table1[[#This Row],[Q1]]","v":"Ortho-"}]
[null,209,{"$f":"Rep_Data!A211","v":"SANDRA,  TORY"},{"$f":"Rep_Data!C211","v":"O23768"},{"$f":"Rep_Data!G211","v":"Belleville"},{"$f":"Rep_Data!H211","v":"WV"},{"$f":"Rep_Data!I211","v":"26133"},{"$f":"Rep_Data!J211","v":"GP"},{"$f":"IF(Rep_Data!N211 = 0, \"-\",IF(Rep_Data!N211 = \"\",\"-\",Rep_Data!N211))","v":"-"},{"$f":"IF(Rep_Data!O211 = 0, \"-\",IF(Rep_Data!O211 = \"\",\"-\",Rep_Data!O211))","v":"-"},{"$f":"IF(Rep_Data!P211 = 0, \"-\",IF(Rep_Data!P211 = \"\",\"-\",Rep_Data!P211))","v":"-"},{"$f":"IF(Rep_Data!Q211 = 0, \"-\",IF(Rep_Data!Q211 = \"\",\"-\",Rep_Data!Q211))","v":"-"},{"$f":"IF(Rep_Data!R211 = 0, \"-\",IF(Rep_Data!R211 = \"\",\"-\",Rep_Data!R211))","v":"-"},null,null,null,null,null,null,null,null,null,null,null,null,null,{"$f":"Table1[[#This Row],[Speciality]]&Table1[[#This Row],[Q1]]","v":"GP-"}]
[null,210,{"$f":"Rep_Data!A212","v":"SAVANNA,  ASIA"},{"$f":"Rep_Data!C212","v":"O62841"},{"$f":"Rep_Data!G212","v":"Santa Ana"},{"$f":"Rep_Data!H212","v":"CA"},{"$f":"Rep_Data!I212","v":"92711"},{"$f":"Rep_Data!J212","v":"GP"},{"$f":"IF(Rep_Data!N212 = 0, \"-\",IF(Rep_Data!N212 = \"\",\"-\",Rep_Data!N212))","v":"-"},{"$f":"IF(Rep_Data!O212 = 0, \"-\",IF(Rep_Data!O212 = \"\",\"-\",Rep_Data!O212))","v":"-"},{"$f":"IF(Rep_Data!P212 = 0, \"-\",IF(Rep_Data!P212 = \"\",\"-\",Rep_Data!P212))","v":"-"},{"$f":"IF(Rep_Data!Q212 = 0, \"-\",IF(Rep_Data!Q212 = \"\",\"-\",Rep_Data!Q212))","v":"-"},{"$f":"IF(Rep_Data!R212 = 0, \"-\",IF(Rep_Data!R212 = \"\",\"-\",Rep_Data!R212))","v":"-"},null,null,null,null,null,null,null,null,null,null,null,null,null,{"$f":"Table1[[#This Row],[Speciality]]&Table1[[#This Row],[Q1]]","v":"GP-"}]
[null,211,{"$f":"Rep_Data!A213","v":"SCOTT,  JONELL"},{"$f":"Rep_Data!C213","v":"O71224"},{"$f":"Rep_Data!G213","v":"Bee Branch"},{"$f":"Rep_Data!H213","v":"AR"},{"$f":"Rep_Data!I213","v":"72013"},{"$f":"Rep_Data!J213","v":"GP"},{"$f":"IF(Rep_Data!N213 = 0, \"-\",IF(Rep_Data!N213 = \"\",\"-\",Rep_Data!N213))","v":"-"},{"$f":"IF(Rep_Data!O213 = 0, \"-\",IF(Rep_Data!O213 = \"\",\"-\",Rep_Data!O213))","v":"-"},{"$f":"IF(Rep_Data!P213 = 0, \"-\",IF(Rep_Data!P213 = \"\",\"-\",Rep_Data!P213))","v":"-"},{"$f":"IF(Rep_Data!Q213 = 0, \"-\",IF(Rep_Data!Q213 = \"\",\"-\",Rep_Data!Q213))","v":"-"},{"$f":"IF(Rep_Data!R213 = 0, \"-\",IF(Rep_Data!R213 = \"\",\"-\",Rep_Data!R213))","v":"-"},null,null,null,null,null,null,null,null,null,null,null,null,null,{"$f":"Table1[[#This Row],[Speciality]]&Table1[[#This Row],[Q1]]","v":"GP-"}]
[null,212,{"$f":"Rep_Data!A214","v":"SELMA,  TAMMARA"},{"$f":"Rep_Data!C214","v":"O60441"},{"$f":"Rep_Data!G214","v":"Mount Cory"},{"$f":"Rep_Data!H214","v":"OH"},{"$f":"Rep_Data!I214","v":"45868"},{"$f":"Rep_Data!J214","v":"GP"},{"$f":"IF(Rep_Data!N214 = 0, \"-\",IF(Rep_Data!N214 = \"\",\"-\",Rep_Data!N214))","v":"-"},{"$f":"IF(Rep_Data!O214 = 0, \"-\",IF(Rep_Data!O214 = \"\",\"-\",Rep_Data!O214))","v":"-"},{"$f":"IF(Rep_Data!P214 = 0, \"-\",IF(Rep_Data!P214 = \"\",\"-\",Rep_Data!P214))","v":"-"},{"$f":"IF(Rep_Data!Q214 = 0, \"-\",IF(Rep_Data!Q214 = \"\",\"-\",Rep_Data!Q214))","v":"-"},{"$f":"IF(Rep_Data!R214 = 0, \"-\",IF(Rep_Data!R214 = \"\",\"-\",Rep_Data!R214))","v":"-"},null,null,null,null,null,null,null,null,null,null,null,null,null,{"$f":"Table1[[#This Row],[Speciality]]&Table1[[#This Row],[Q1]]","v":"GP-"}]
[null,213,{"$f":"Rep_Data!A215","v":"SHALONDA,  MORGAN"},{"$f":"Rep_Data!C215","v":"O55057"},{"$f":"Rep_Data!G215","v":"Mount Sterling"},{"$f":"Rep_Data!H215","v":"WI"},{"$f":"Rep_Data!I215","v":"54645"},{"$f":"Rep_Data!J215","v":"GP"},{"$f":"IF(Rep_Data!N215 = 0, \"-\",IF(Rep_Data!N215 = \"\",\"-\",Rep_Data!N215))","v":"-"},{"$f":"IF(Rep_Data!O215 = 0, \"-\",IF(Rep_Data!O215 = \"\",\"-\",Rep_Data!O215))","v":"-"},{"$f":"IF(Rep_Data!P215 = 0, \"-\",IF(Rep_Data!P215 = \"\",\"-\",Rep_Data!P215))","v":"-"},{"$f":"IF(Rep_Data!Q215 = 0, \"-\",IF(Rep_Data!Q215 = \"\",\"-\",Rep_Data!Q215))","v":"-"},{"$f":"IF(Rep_Data!R215 = 0, \"-\",IF(Rep_Data!R215 = \"\",\"-\",Rep_Data!R215))","v":"-"},null,null,null,null,null,null,null,null,null,null,null,null,null,{"$f":"Table1[[#This Row],[Speciality]]&Table1[[#This Row],[Q1]]","v":"GP-"}]
[null,214,{"$f":"Rep_Data!A216","v":"SHAMIKA,  ARMAND"},{"$f":"Rep_Data!C216","v":"O68970"},{"$f":"Rep_Data!G216","v":"Topeka"},{"$f":"Rep_Data!H216","v":"KS"},{"$f":"Rep_Data!I216","v":"66624"},{"$f":"Rep_Data!J216","v":"GP"},{"$f":"IF(Rep_Data!N216 = 0, \"-\",IF(Rep_Data!N216 = \"\",\"-\",Rep_Data!N216))","v":"-"},{"$f":"IF(Rep_Data!O216 = 0, \"-\",IF(Rep_Data!O216 = \"\",\"-\",Rep_Data!O216))","v":"-"},{"$f":"IF(Rep_Data!P216 = 0, \"-\",IF(Rep_Data!P216 = \"\",\"-\",Rep_Data!P216))","v":"-"},{"$f":"IF(Rep_Data!Q216 = 0, \"-\",IF(Rep_Data!Q216 = \"\",\"-\",Rep_Data!Q216))","v":"-"},{"$f":"IF(Rep_Data!R216 = 0, \"-\",IF(Rep_Data!R216 = \"\",\"-\",Rep_Data!R216))","v":"-"},null,null,null,null,null,null,null,null,null,null,null,null,null,{"$f":"Table1[[#This Row],[Speciality]]&Table1[[#This Row],[Q1]]","v":"GP-"}]
[null,215,{"$f":"Rep_Data!A217","v":"SHANELLE,  HAYDEN"},{"$f":"Rep_Data!C217","v":"O65078"},{"$f":"Rep_Data!G217","v":"Glenbrook"},{"$f":"Rep_Data!H217","v":"NV"},{"$f":"Rep_Data!I217","v":"89413"},{"$f":"Rep_Data!J217","v":"Ortho"},{"$f":"IF(Rep_Data!N217 = 0, \"-\",IF(Rep_Data!N217 = \"\",\"-\",Rep_Data!N217))","v":"-"},{"$f":"IF(Rep_Data!O217 = 0, \"-\",IF(Rep_Data!O217 = \"\",\"-\",Rep_Data!O217))","v":"-"},{"$f":"IF(Rep_Data!P217 = 0, \"-\",IF(Rep_Data!P217 = \"\",\"-\",Rep_Data!P217))","v":"-"},{"$f":"IF(Rep_Data!Q217 = 0, \"-\",IF(Rep_Data!Q217 = \"\",\"-\",Rep_Data!Q217))","v":"-"},{"$f":"IF(Rep_Data!R217 = 0, \"-\",IF(Rep_Data!R217 = \"\",\"-\",Rep_Data!R217))","v":"-"},null,null,null,null,null,null,null,null,null,null,null,null,null,{"$f":"Table1[[#This Row],[Speciality]]&Table1[[#This Row],[Q1]]","v":"Ortho-"}]
[null,216,{"$f":"Rep_Data!A218","v":"SHANTI,  ANGEL"},{"$f":"Rep_Data!C218","v":"O68876"},{"$f":"Rep_Data!G218","v":"Point Roberts"},{"$f":"Rep_Data!H218","v":"WA"},{"$f":"Rep_Data!I218","v":"98281"},{"$f":"Rep_Data!J218","v":"Ortho"},{"$f":"IF(Rep_Data!N218 = 0, \"-\",IF(Rep_Data!N218 = \"\",\"-\",Rep_Data!N218))","v":"-"},{"$f":"IF(Rep_Data!O218 = 0, \"-\",IF(Rep_Data!O218 = \"\",\"-\",Rep_Data!O218))","v":"-"},{"$f":"IF(Rep_Data!P218 = 0, \"-\",IF(Rep_Data!P218 = \"\",\"-\",Rep_Data!P218))","v":"-"},{"$f":"IF(Rep_Data!Q218 = 0, \"-\",IF(Rep_Data!Q218 = \"\",\"-\",Rep_Data!Q218))","v":"-"},{"$f":"IF(Rep_Data!R218 = 0, \"-\",IF(Rep_Data!R218 = \"\",\"-\",Rep_Data!R218))","v":"-"},null,null,null,null,null,null,null,null,null,null,null,null,null,{"$f":"Table1[[#This Row],[Speciality]]&Table1[[#This Row],[Q1]]","v":"Ortho-"}]
[null,217,{"$f":"Rep_Data!A219","v":"SHARYL,  DANNIE"},{"$f":"Rep_Data!C219","v":"O77679"},{"$f":"Rep_Data!G219","v":"Lantry"},{"$f":"Rep_Data!H219","v":"SD"},{"$f":"Rep_Data!I219","v":"57636"},{"$f":"Rep_Data!J219","v":"GP"},{"$f":"IF(Rep_Data!N219 = 0, \"-\",IF(Rep_Data!N219 = \"\",\"-\",Rep_Data!N219))","v":"-"},{"$f":"IF(Rep_Data!O219 = 0, \"-\",IF(Rep_Data!O219 = \"\",\"-\",Rep_Data!O219))","v":"-"},{"$f":"IF(Rep_Data!P219 = 0, \"-\",IF(Rep_Data!P219 = \"\",\"-\",Rep_Data!P219))","v":"-"},{"$f":"IF(Rep_Data!Q219 = 0, \"-\",IF(Rep_Data!Q219 = \"\",\"-\",Rep_Data!Q219))","v":"-"},{"$f":"IF(Rep_Data!R219 = 0, \"-\",IF(Rep_Data!R219 = \"\",\"-\",Rep_Data!R219))","v":"-"},null,null,null,null,null,null,null,null,null,null,null,null,null,{"$f":"Table1[[#This Row],[Speciality]]&Table1[[#This Row],[Q1]]","v":"GP-"}]
[null,218,{"$f":"Rep_Data!A220","v":"SHAVON,  STACIA"},{"$f":"Rep_Data!C220","v":"O53179"},{"$f":"Rep_Data!G220","v":"El Paso"},{"$f":"Rep_Data!H220","v":"TX"},{"$f":"Rep_Data!I220","v":"88565"},{"$f":"Rep_Data!J220","v":"GP"},{"$f":"IF(Rep_Data!N220 = 0, \"-\",IF(Rep_Data!N220 = \"\",\"-\",Rep_Data!N220))","v":"-"},{"$f":"IF(Rep_Data!O220 = 0, \"-\",IF(Rep_Data!O220 = \"\",\"-\",Rep_Data!O220))","v":"-"},{"$f":"IF(Rep_Data!P220 = 0, \"-\",IF(Rep_Data!P220 = \"\",\"-\",Rep_Data!P220))","v":"-"},{"$f":"IF(Rep_Data!Q220 = 0, \"-\",IF(Rep_Data!Q220 = \"\",\"-\",Rep_Data!Q220))","v":"-"},{"$f":"IF(Rep_Data!R220 = 0, \"-\",IF(Rep_Data!R220 = \"\",\"-\",Rep_Data!R220))","v":"-"},null,null,null,null,null,null,null,null,null,null,null,null,null,{"$f":"Table1[[#This Row],[Speciality]]&Table1[[#This Row],[Q1]]","v":"GP-"}]
[null,219,{"$f":"Rep_Data!A221","v":"SHAWANNA,  DEDRA"},{"$f":"Rep_Data!C221","v":"O52953"},{"$f":"Rep_Data!G221","v":"Woburn"},{"$f":"Rep_Data!H221","v":"MA"},{"$f":"Rep_Data!I221","v":"01807"},{"$f":"Rep_Data!J221","v":"GP"},{"$f":"IF(Rep_Data!N221 = 0, \"-\",IF(Rep_Data!N221 = \"\",\"-\",Rep_Data!N221))","v":"-"},{"$f":"IF(Rep_Data!O221 = 0, \"-\",IF(Rep_Data!O221 = \"\",\"-\",Rep_Data!O221))","v":"-"},{"$f":"IF(Rep_Data!P221 = 0, \"-\",IF(Rep_Data!P221 = \"\",\"-\",Rep_Data!P221))","v":"-"},{"$f":"IF(Rep_Data!Q221 = 0, \"-\",IF(Rep_Data!Q221 = \"\",\"-\",Rep_Data!Q221))","v":"-"},{"$f":"IF(Rep_Data!R221 = 0, \"-\",IF(Rep_Data!R221 = \"\",\"-\",Rep_Data!R221))","v":"-"},null,null,null,null,null,null,null,null,null,null,null,null,null,{"$f":"Table1[[#This Row],[Speciality]]&Table1[[#This Row],[Q1]]","v":"GP-"}]
[null,220,{"$f":"Rep_Data!A222","v":"SHEILA,  ROCCO"},{"$f":"Rep_Data!C222","v":"O79508"},{"$f":"Rep_Data!G222","v":"Miami"},{"$f":"Rep_Data!H222","v":"FL"},{"$f":"Rep_Data!I222","v":"33266"},{"$f":"Rep_Data!J222","v":"Surgery"},{"$f":"IF(Rep_Data!N222 = 0, \"-\",IF(Rep_Data!N222 = \"\",\"-\",Rep_Data!N222))","v":"-"},{"$f":"IF(Rep_Data!O222 = 0, \"-\",IF(Rep_Data!O222 = \"\",\"-\",Rep_Data!O222))","v":"-"},{"$f":"IF(Rep_Data!P222 = 0, \"-\",IF(Rep_Data!P222 = \"\",\"-\",Rep_Data!P222))","v":"-"},{"$f":"IF(Rep_Data!Q222 = 0, \"-\",IF(Rep_Data!Q222 = \"\",\"-\",Rep_Data!Q222))","v":"-"},{"$f":"IF(Rep_Data!R222 = 0, \"-\",IF(Rep_Data!R222 = \"\",\"-\",Rep_Data!R222))","v":"-"},null,null,null,null,null,null,null,null,null,null,null,null,null,{"$f":"Table1[[#This Row],[Speciality]]&Table1[[#This Row],[Q1]]","v":"Surgery-"}]
[null,221,{"$f":"Rep_Data!A223","v":"SHELBY,  LUZ"},{"$f":"Rep_Data!C223","v":"O79658"},{"$f":"Rep_Data!G223","v":"Morenci"},{"$f":"Rep_Data!H223","v":"AZ"},{"$f":"Rep_Data!I223","v":"85540"},{"$f":"Rep_Data!J223","v":"Surgery"},{"$f":"IF(Rep_Data!N223 = 0, \"-\",IF(Rep_Data!N223 = \"\",\"-\",Rep_Data!N223))","v":"-"},{"$f":"IF(Rep_Data!O223 = 0, \"-\",IF(Rep_Data!O223 = \"\",\"-\",Rep_Data!O223))","v":"-"},{"$f":"IF(Rep_Data!P223 = 0, \"-\",IF(Rep_Data!P223 = \"\",\"-\",Rep_Data!P223))","v":"-"},{"$f":"IF(Rep_Data!Q223 = 0, \"-\",IF(Rep_Data!Q223 = \"\",\"-\",Rep_Data!Q223))","v":"-"},{"$f":"IF(Rep_Data!R223 = 0, \"-\",IF(Rep_Data!R223 = \"\",\"-\",Rep_Data!R223))","v":"-"},null,null,null,null,null,null,null,null,null,null,null,null,null,{"$f":"Table1[[#This Row],[Speciality]]&Table1[[#This Row],[Q1]]","v":"Surgery-"}]
[null,222,{"$f":"Rep_Data!A224","v":"SHONTA,  HOLLIS"},{"$f":"Rep_Data!C224","v":"O59469"},{"$f":"Rep_Data!G224","v":"Hemingford"},{"$f":"Rep_Data!H224","v":"NE"},{"$f":"Rep_Data!I224","v":"69348"},{"$f":"Rep_Data!J224","v":"Surgery"},{"$f":"IF(Rep_Data!N224 = 0, \"-\",IF(Rep_Data!N224 = \"\",\"-\",Rep_Data!N224))","v":"-"},{"$f":"IF(Rep_Data!O224 = 0, \"-\",IF(Rep_Data!O224 = \"\",\"-\",Rep_Data!O224))","v":"-"},{"$f":"IF(Rep_Data!P224 = 0, \"-\",IF(Rep_Data!P224 = \"\",\"-\",Rep_Data!P224))","v":"-"},{"$f":"IF(Rep_Data!Q224 = 0, \"-\",IF(Rep_Data!Q224 = \"\",\"-\",Rep_Data!Q224))","v":"-"},{"$f":"IF(Rep_Data!R224 = 0, \"-\",IF(Rep_Data!R224 = \"\",\"-\",Rep_Data!R224))","v":"-"},null,null,null,null,null,null,null,null,null,null,null,null,null,{"$f":"Table1[[#This Row],[Speciality]]&Table1[[#This Row],[Q1]]","v":"Surgery-"}]
[null,223,{"$f":"Rep_Data!A225","v":"STEPHEN,  JOAN"},{"$f":"Rep_Data!C225","v":"O57857"},{"$f":"Rep_Data!G225","v":"Tonto Basin"},{"$f":"Rep_Data!H225","v":"AZ"},{"$f":"Rep_Data!I225","v":"85553"},{"$f":"Rep_Data!J225","v":"GP"},{"$f":"IF(Rep_Data!N225 = 0, \"-\",IF(Rep_Data!N225 = \"\",\"-\",Rep_Data!N225))","v":"-"},{"$f":"IF(Rep_Data!O225 = 0, \"-\",IF(Rep_Data!O225 = \"\",\"-\",Rep_Data!O225))","v":"-"},{"$f":"IF(Rep_Data!P225 = 0, \"-\",IF(Rep_Data!P225 = \"\",\"-\",Rep_Data!P225))","v":"-"},{"$f":"IF(Rep_Data!Q225 = 0, \"-\",IF(Rep_Data!Q225 = \"\",\"-\",Rep_Data!Q225))","v":"-"},{"$f":"IF(Rep_Data!R225 = 0, \"-\",IF(Rep_Data!R225 = \"\",\"-\",Rep_Data!R225))","v":"-"},null,null,null,null,null,null,null,null,null,null,null,null,null,{"$f":"Table1[[#This Row],[Speciality]]&Table1[[#This Row],[Q1]]","v":"GP-"}]
[null,224,{"$f":"Rep_Data!A226","v":"SU,  ALDA"},{"$f":"Rep_Data!C226","v":"O62663"},{"$f":"Rep_Data!G226","v":"Screven"},{"$f":"Rep_Data!H226","v":"GA"},{"$f":"Rep_Data!I226","v":"31560"},{"$f":"Rep_Data!J226","v":"GP"},{"$f":"IF(Rep_Data!N226 = 0, \"-\",IF(Rep_Data!N226 = \"\",\"-\",Rep_Data!N226))","v":"-"},{"$f":"IF(Rep_Data!O226 = 0, \"-\",IF(Rep_Data!O226 = \"\",\"-\",Rep_Data!O226))","v":"-"},{"$f":"IF(Rep_Data!P226 = 0, \"-\",IF(Rep_Data!P226 = \"\",\"-\",Rep_Data!P226))","v":"-"},{"$f":"IF(Rep_Data!Q226 = 0, \"-\",IF(Rep_Data!Q226 = \"\",\"-\",Rep_Data!Q226))","v":"-"},{"$f":"IF(Rep_Data!R226 = 0, \"-\",IF(Rep_Data!R226 = \"\",\"-\",Rep_Data!R226))","v":"-"},null,null,null,null,null,null,null,null,null,null,null,null,null,{"$f":"Table1[[#This Row],[Speciality]]&Table1[[#This Row],[Q1]]","v":"GP-"}]
[null,225,{"$f":"Rep_Data!A227","v":"SUMMER,  MILLY"},{"$f":"Rep_Data!C227","v":"O63153"},{"$f":"Rep_Data!G227","v":"Indianapolis"},{"$f":"Rep_Data!H227","v":"IN"},{"$f":"Rep_Data!I227","v":"46236"},{"$f":"Rep_Data!J227","v":"Surgery"},{"$f":"IF(Rep_Data!N227 = 0, \"-\",IF(Rep_Data!N227 = \"\",\"-\",Rep_Data!N227))","v":"-"},{"$f":"IF(Rep_Data!O227 = 0, \"-\",IF(Rep_Data!O227 = \"\",\"-\",Rep_Data!O227))","v":"-"},{"$f":"IF(Rep_Data!P227 = 0, \"-\",IF(Rep_Data!P227 = \"\",\"-\",Rep_Data!P227))","v":"-"},{"$f":"IF(Rep_Data!Q227 = 0, \"-\",IF(Rep_Data!Q227 = \"\",\"-\",Rep_Data!Q227))","v":"-"},{"$f":"IF(Rep_Data!R227 = 0, \"-\",IF(Rep_Data!R227 = \"\",\"-\",Rep_Data!R227))","v":"-"},null,null,null,null,null,null,null,null,null,null,null,null,null,{"$f":"Table1[[#This Row],[Speciality]]&Table1[[#This Row],[Q1]]","v":"Surgery-"}]
[null,226,{"$f":"Rep_Data!A228","v":"SUNNI,  RETTA"},{"$f":"Rep_Data!C228","v":"O71629"},{"$f":"Rep_Data!G228","v":"Amador City"},{"$f":"Rep_Data!H228","v":"CA"},{"$f":"Rep_Data!I228","v":"95601"},{"$f":"Rep_Data!J228","v":"Ortho"},{"$f":"IF(Rep_Data!N228 = 0, \"-\",IF(Rep_Data!N228 = \"\",\"-\",Rep_Data!N228))","v":"-"},{"$f":"IF(Rep_Data!O228 = 0, \"-\",IF(Rep_Data!O228 = \"\",\"-\",Rep_Data!O228))","v":"-"},{"$f":"IF(Rep_Data!P228 = 0, \"-\",IF(Rep_Data!P228 = \"\",\"-\",Rep_Data!P228))","v":"-"},{"$f":"IF(Rep_Data!Q228 = 0, \"-\",IF(Rep_Data!Q228 = \"\",\"-\",Rep_Data!Q228))","v":"-"},{"$f":"IF(Rep_Data!R228 = 0, \"-\",IF(Rep_Data!R228 = \"\",\"-\",Rep_Data!R228))","v":"-"},null,null,null,null,null,null,null,null,null,null,null,null,null,{"$f":"Table1[[#This Row],[Speciality]]&Table1[[#This Row],[Q1]]","v":"Ortho-"}]
[null,227,{"$f":"Rep_Data!A229","v":"TAD,  APOLONIA"},{"$f":"Rep_Data!C229","v":"O75270"},{"$f":"Rep_Data!G229","v":"Oak Creek"},{"$f":"Rep_Data!H229","v":"WI"},{"$f":"Rep_Data!I229","v":"53154"},{"$f":"Rep_Data!J229","v":"Ortho"},{"$f":"IF(Rep_Data!N229 = 0, \"-\",IF(Rep_Data!N229 = \"\",\"-\",Rep_Data!N229))","v":"-"},{"$f":"IF(Rep_Data!O229 = 0, \"-\",IF(Rep_Data!O229 = \"\",\"-\",Rep_Data!O229))","v":"-"},{"$f":"IF(Rep_Data!P229 = 0, \"-\",IF(Rep_Data!P229 = \"\",\"-\",Rep_Data!P229))","v":"-"},{"$f":"IF(Rep_Data!Q229 = 0, \"-\",IF(Rep_Data!Q229 = \"\",\"-\",Rep_Data!Q229))","v":"-"},{"$f":"IF(Rep_Data!R229 = 0, \"-\",IF(Rep_Data!R229 = \"\",\"-\",Rep_Data!R229))","v":"-"},null,null,null,null,null,null,null,null,null,null,null,null,null,{"$f":"Table1[[#This Row],[Speciality]]&Table1[[#This Row],[Q1]]","v":"Ortho-"}]
[null,228,{"$f":"Rep_Data!A230","v":"TAMESHA,  JANEEN"},{"$f":"Rep_Data!C230","v":"O79087"},{"$f":"Rep_Data!G230","v":"Stinesville"},{"$f":"Rep_Data!H230","v":"IN"},{"$f":"Rep_Data!I230","v":"47464"},{"$f":"Rep_Data!J230","v":"GP"},{"$f":"IF(Rep_Data!N230 = 0, \"-\",IF(Rep_Data!N230 = \"\",\"-\",Rep_Data!N230))","v":"-"},{"$f":"IF(Rep_Data!O230 = 0, \"-\",IF(Rep_Data!O230 = \"\",\"-\",Rep_Data!O230))","v":"-"},{"$f":"IF(Rep_Data!P230 = 0, \"-\",IF(Rep_Data!P230 = \"\",\"-\",Rep_Data!P230))","v":"-"},{"$f":"IF(Rep_Data!Q230 = 0, \"-\",IF(Rep_Data!Q230 = \"\",\"-\",Rep_Data!Q230))","v":"-"},{"$f":"IF(Rep_Data!R230 = 0, \"-\",IF(Rep_Data!R230 = \"\",\"-\",Rep_Data!R230))","v":"-"},null,null,null,null,null,null,null,null,null,null,null,null,null,{"$f":"Table1[[#This Row],[Speciality]]&Table1[[#This Row],[Q1]]","v":"GP-"}]
[null,229,{"$f":"Rep_Data!A231","v":"TAMMERA,  CARMELO"},{"$f":"Rep_Data!C231","v":"O61106"},{"$f":"Rep_Data!G231","v":"Raleigh"},{"$f":"Rep_Data!H231","v":"NC"},{"$f":"Rep_Data!I231","v":"27619"},{"$f":"Rep_Data!J231","v":"Surgery"},{"$f":"IF(Rep_Data!N231 = 0, \"-\",IF(Rep_Data!N231 = \"\",\"-\",Rep_Data!N231))","v":"-"},{"$f":"IF(Rep_Data!O231 = 0, \"-\",IF(Rep_Data!O231 = \"\",\"-\",Rep_Data!O231))","v":"-"},{"$f":"IF(Rep_Data!P231 = 0, \"-\",IF(Rep_Data!P231 = \"\",\"-\",Rep_Data!P231))","v":"-"},{"$f":"IF(Rep_Data!Q231 = 0, \"-\",IF(Rep_Data!Q231 = \"\",\"-\",Rep_Data!Q231))","v":"-"},{"$f":"IF(Rep_Data!R231 = 0, \"-\",IF(Rep_Data!R231 = \"\",\"-\",Rep_Data!R231))","v":"-"},null,null,null,null,null,null,null,null,null,null,null,null,null,{"$f":"Table1[[#This Row],[Speciality]]&Table1[[#This Row],[Q1]]","v":"Surgery-"}]
[null,230,{"$f":"Rep_Data!A232","v":"TAMRA,  CARLOS"},{"$f":"Rep_Data!C232","v":"O59613"},{"$f":"Rep_Data!G232","v":"Gypsy"},{"$f":"Rep_Data!H232","v":"WV"},{"$f":"Rep_Data!I232","v":"26361"},{"$f":"Rep_Data!J232","v":"GP"},{"$f":"IF(Rep_Data!N232 = 0, \"-\",IF(Rep_Data!N232 = \"\",\"-\",Rep_Data!N232))","v":"-"},{"$f":"IF(Rep_Data!O232 = 0, \"-\",IF(Rep_Data!O232 = \"\",\"-\",Rep_Data!O232))","v":"-"},{"$f":"IF(Rep_Data!P232 = 0, \"-\",IF(Rep_Data!P232 = \"\",\"-\",Rep_Data!P232))","v":"-"},{"$f":"IF(Rep_Data!Q232 = 0, \"-\",IF(Rep_Data!Q232 = \"\",\"-\",Rep_Data!Q232))","v":"-"},{"$f":"IF(Rep_Data!R232 = 0, \"-\",IF(Rep_Data!R232 = \"\",\"-\",Rep_Data!R232))","v":"-"},null,null,null,null,null,null,null,null,null,null,null,null,null,{"$f":"Table1[[#This Row],[Speciality]]&Table1[[#This Row],[Q1]]","v":"GP-"}]
[null,231,{"$f":"Rep_Data!A233","v":"TATUM,  MICHAEL"},{"$f":"Rep_Data!C233","v":"O75200"},{"$f":"Rep_Data!G233","v":"Sautee Nacoochee"},{"$f":"Rep_Data!H233","v":"GA"},{"$f":"Rep_Data!I233","v":"30571"},{"$f":"Rep_Data!J233","v":"Surgery"},{"$f":"IF(Rep_Data!N233 = 0, \"-\",IF(Rep_Data!N233 = \"\",\"-\",Rep_Data!N233))","v":"-"},{"$f":"IF(Rep_Data!O233 = 0, \"-\",IF(Rep_Data!O233 = \"\",\"-\",Rep_Data!O233))","v":"-"},{"$f":"IF(Rep_Data!P233 = 0, \"-\",IF(Rep_Data!P233 = \"\",\"-\",Rep_Data!P233))","v":"-"},{"$f":"IF(Rep_Data!Q233 = 0, \"-\",IF(Rep_Data!Q233 = \"\",\"-\",Rep_Data!Q233))","v":"-"},{"$f":"IF(Rep_Data!R233 = 0, \"-\",IF(Rep_Data!R233 = \"\",\"-\",Rep_Data!R233))","v":"-"},null,null,null,null,null,null,null,null,null,null,null,null,null,{"$f":"Table1[[#This Row],[Speciality]]&Table1[[#This Row],[Q1]]","v":"Surgery-"}]
[null,232,{"$f":"Rep_Data!A234","v":"TAWNA,  ARNULFO"},{"$f":"Rep_Data!C234","v":"O51510"},{"$f":"Rep_Data!G234","v":"Chattanooga"},{"$f":"Rep_Data!H234","v":"TN"},{"$f":"Rep_Data!I234","v":"37406"},{"$f":"Rep_Data!J234","v":"GP"},{"$f":"IF(Rep_Data!N234 = 0, \"-\",IF(Rep_Data!N234 = \"\",\"-\",Rep_Data!N234))","v":"-"},{"$f":"IF(Rep_Data!O234 = 0, \"-\",IF(Rep_Data!O234 = \"\",\"-\",Rep_Data!O234))","v":"-"},{"$f":"IF(Rep_Data!P234 = 0, \"-\",IF(Rep_Data!P234 = \"\",\"-\",Rep_Data!P234))","v":"-"},{"$f":"IF(Rep_Data!Q234 = 0, \"-\",IF(Rep_Data!Q234 = \"\",\"-\",Rep_Data!Q234))","v":"-"},{"$f":"IF(Rep_Data!R234 = 0, \"-\",IF(Rep_Data!R234 = \"\",\"-\",Rep_Data!R234))","v":"-"},null,null,null,null,null,null,null,null,null,null,null,null,null,{"$f":"Table1[[#This Row],[Speciality]]&Table1[[#This Row],[Q1]]","v":"GP-"}]
[null,233,{"$f":"Rep_Data!A235","v":"TAWNYA,  LOLA"},{"$f":"Rep_Data!C235","v":"O62116"},{"$f":"Rep_Data!G235","v":"Philadelphia"},{"$f":"Rep_Data!H235","v":"PA"},{"$f":"Rep_Data!I235","v":"19184"},{"$f":"Rep_Data!J235","v":"Ortho"},{"$f":"IF(Rep_Data!N235 = 0, \"-\",IF(Rep_Data!N235 = \"\",\"-\",Rep_Data!N235))","v":"-"},{"$f":"IF(Rep_Data!O235 = 0, \"-\",IF(Rep_Data!O235 = \"\",\"-\",Rep_Data!O235))","v":"-"},{"$f":"IF(Rep_Data!P235 = 0, \"-\",IF(Rep_Data!P235 = \"\",\"-\",Rep_Data!P235))","v":"-"},{"$f":"IF(Rep_Data!Q235 = 0, \"-\",IF(Rep_Data!Q235 = \"\",\"-\",Rep_Data!Q235))","v":"-"},{"$f":"IF(Rep_Data!R235 = 0, \"-\",IF(Rep_Data!R235 = \"\",\"-\",Rep_Data!R235))","v":"-"},null,null,null,null,null,null,null,null,null,null,null,null,null,{"$f":"Table1[[#This Row],[Speciality]]&Table1[[#This Row],[Q1]]","v":"Ortho-"}]
[null,234,{"$f":"Rep_Data!A236","v":"TEREASA,  GONZALO"},{"$f":"Rep_Data!C236","v":"O50398"},{"$f":"Rep_Data!G236","v":"Economy"},{"$f":"Rep_Data!H236","v":"IN"},{"$f":"Rep_Data!I236","v":"47339"},{"$f":"Rep_Data!J236","v":"Ortho"},{"$f":"IF(Rep_Data!N236 = 0, \"-\",IF(Rep_Data!N236 = \"\",\"-\",Rep_Data!N236))","v":"-"},{"$f":"IF(Rep_Data!O236 = 0, \"-\",IF(Rep_Data!O236 = \"\",\"-\",Rep_Data!O236))","v":"-"},{"$f":"IF(Rep_Data!P236 = 0, \"-\",IF(Rep_Data!P236 = \"\",\"-\",Rep_Data!P236))","v":"-"},{"$f":"IF(Rep_Data!Q236 = 0, \"-\",IF(Rep_Data!Q236 = \"\",\"-\",Rep_Data!Q236))","v":"-"},{"$f":"IF(Rep_Data!R236 = 0, \"-\",IF(Rep_Data!R236 = \"\",\"-\",Rep_Data!R236))","v":"-"},null,null,null,null,null,null,null,null,null,null,null,null,null,{"$f":"Table1[[#This Row],[Speciality]]&Table1[[#This Row],[Q1]]","v":"Ortho-"}]
[null,235,{"$f":"Rep_Data!A237","v":"TESHA,  MAE"},{"$f":"Rep_Data!C237","v":"O50349"},{"$f":"Rep_Data!G237","v":"New Port Richey"},{"$f":"Rep_Data!H237","v":"FL"},{"$f":"Rep_Data!I237","v":"34655"},{"$f":"Rep_Data!J237","v":"GP"},{"$f":"IF(Rep_Data!N237 = 0, \"-\",IF(Rep_Data!N237 = \"\",\"-\",Rep_Data!N237))","v":"-"},{"$f":"IF(Rep_Data!O237 = 0, \"-\",IF(Rep_Data!O237 = \"\",\"-\",Rep_Data!O237))","v":"-"},{"$f":"IF(Rep_Data!P237 = 0, \"-\",IF(Rep_Data!P237 = \"\",\"-\",Rep_Data!P237))","v":"-"},{"$f":"IF(Rep_Data!Q237 = 0, \"-\",IF(Rep_Data!Q237 = \"\",\"-\",Rep_Data!Q237))","v":"-"},{"$f":"IF(Rep_Data!R237 = 0, \"-\",IF(Rep_Data!R237 = \"\",\"-\",Rep_Data!R237))","v":"-"},null,null,null,null,null,null,null,null,null,null,null,null,null,{"$f":"Table1[[#This Row],[Speciality]]&Table1[[#This Row],[Q1]]","v":"GP-"}]
[null,236,{"$f":"Rep_Data!A238","v":"TIMOTHY,  ALETHA"},{"$f":"Rep_Data!C238","v":"O51630"},{"$f":"Rep_Data!G238","v":"Waltham"},{"$f":"Rep_Data!H238","v":"MA"},{"$f":"Rep_Data!I238","v":"02453"},{"$f":"Rep_Data!J238","v":"Surgery"},{"$f":"IF(Rep_Data!N238 = 0, \"-\",IF(Rep_Data!N238 = \"\",\"-\",Rep_Data!N238))","v":"-"},{"$f":"IF(Rep_Data!O238 = 0, \"-\",IF(Rep_Data!O238 = \"\",\"-\",Rep_Data!O238))","v":"-"},{"$f":"IF(Rep_Data!P238 = 0, \"-\",IF(Rep_Data!P238 = \"\",\"-\",Rep_Data!P238))","v":"-"},{"$f":"IF(Rep_Data!Q238 = 0, \"-\",IF(Rep_Data!Q238 = \"\",\"-\",Rep_Data!Q238))","v":"-"},{"$f":"IF(Rep_Data!R238 = 0, \"-\",IF(Rep_Data!R238 = \"\",\"-\",Rep_Data!R238))","v":"-"},null,null,null,null,null,null,null,null,null,null,null,null,null,{"$f":"Table1[[#This Row],[Speciality]]&Table1[[#This Row],[Q1]]","v":"Surgery-"}]
[null,237,{"$f":"Rep_Data!A239","v":"TORIE,  LASONYA"},{"$f":"Rep_Data!C239","v":"O67533"},{"$f":"Rep_Data!G239","v":"Lac Du Flambeau"},{"$f":"Rep_Data!H239","v":"WI"},{"$f":"Rep_Data!I239","v":"54538"},{"$f":"Rep_Data!J239","v":"GP"},{"$f":"IF(Rep_Data!N239 = 0, \"-\",IF(Rep_Data!N239 = \"\",\"-\",Rep_Data!N239))","v":"-"},{"$f":"IF(Rep_Data!O239 = 0, \"-\",IF(Rep_Data!O239 = \"\",\"-\",Rep_Data!O239))","v":"-"},{"$f":"IF(Rep_Data!P239 = 0, \"-\",IF(Rep_Data!P239 = \"\",\"-\",Rep_Data!P239))","v":"-"},{"$f":"IF(Rep_Data!Q239 = 0, \"-\",IF(Rep_Data!Q239 = \"\",\"-\",Rep_Data!Q239))","v":"-"},{"$f":"IF(Rep_Data!R239 = 0, \"-\",IF(Rep_Data!R239 = \"\",\"-\",Rep_Data!R239))","v":"-"},null,null,null,null,null,null,null,null,null,null,null,null,null,{"$f":"Table1[[#This Row],[Speciality]]&Table1[[#This Row],[Q1]]","v":"GP-"}]
[null,238,{"$f":"Rep_Data!A240","v":"TRENTON,  TARYN"},{"$f":"Rep_Data!C240","v":"O50289"},{"$f":"Rep_Data!G240","v":"Fredericksburg"},{"$f":"Rep_Data!H240","v":"TX"},{"$f":"Rep_Data!I240","v":"78624"},{"$f":"Rep_Data!J240","v":"Ortho"},{"$f":"IF(Rep_Data!N240 = 0, \"-\",IF(Rep_Data!N240 = \"\",\"-\",Rep_Data!N240))","v":"-"},{"$f":"IF(Rep_Data!O240 = 0, \"-\",IF(Rep_Data!O240 = \"\",\"-\",Rep_Data!O240))","v":"-"},{"$f":"IF(Rep_Data!P240 = 0, \"-\",IF(Rep_Data!P240 = \"\",\"-\",Rep_Data!P240))","v":"-"},{"$f":"IF(Rep_Data!Q240 = 0, \"-\",IF(Rep_Data!Q240 = \"\",\"-\",Rep_Data!Q240))","v":"-"},{"$f":"IF(Rep_Data!R240 = 0, \"-\",IF(Rep_Data!R240 = \"\",\"-\",Rep_Data!R240))","v":"-"},null,null,null,null,null,null,null,null,null,null,null,null,null,{"$f":"Table1[[#This Row],[Speciality]]&Table1[[#This Row],[Q1]]","v":"Ortho-"}]
[null,239,{"$f":"Rep_Data!A241","v":"TYLER,  LILIA"},{"$f":"Rep_Data!C241","v":"O63169"},{"$f":"Rep_Data!G241","v":"Savoy"},{"$f":"Rep_Data!H241","v":"MA"},{"$f":"Rep_Data!I241","v":"01256"},{"$f":"Rep_Data!J241","v":"GP"},{"$f":"IF(Rep_Data!N241 = 0, \"-\",IF(Rep_Data!N241 = \"\",\"-\",Rep_Data!N241))","v":"-"},{"$f":"IF(Rep_Data!O241 = 0, \"-\",IF(Rep_Data!O241 = \"\",\"-\",Rep_Data!O241))","v":"-"},{"$f":"IF(Rep_Data!P241 = 0, \"-\",IF(Rep_Data!P241 = \"\",\"-\",Rep_Data!P241))","v":"-"},{"$f":"IF(Rep_Data!Q241 = 0, \"-\",IF(Rep_Data!Q241 = \"\",\"-\",Rep_Data!Q241))","v":"-"},{"$f":"IF(Rep_Data!R241 = 0, \"-\",IF(Rep_Data!R241 = \"\",\"-\",Rep_Data!R241))","v":"-"},null,null,null,null,null,null,null,null,null,null,null,null,null,{"$f":"Table1[[#This Row],[Speciality]]&Table1[[#This Row],[Q1]]","v":"GP-"}]
[null,240,{"$f":"Rep_Data!A242","v":"VEDA,  CAROYLN"},{"$f":"Rep_Data!C242","v":"O60298"},{"$f":"Rep_Data!G242","v":"Cordova"},{"$f":"Rep_Data!H242","v":"IL"},{"$f":"Rep_Data!I242","v":"61242"},{"$f":"Rep_Data!J242","v":"GP"},{"$f":"IF(Rep_Data!N242 = 0, \"-\",IF(Rep_Data!N242 = \"\",\"-\",Rep_Data!N242))","v":"-"},{"$f":"IF(Rep_Data!O242 = 0, \"-\",IF(Rep_Data!O242 = \"\",\"-\",Rep_Data!O242))","v":"-"},{"$f":"IF(Rep_Data!P242 = 0, \"-\",IF(Rep_Data!P242 = \"\",\"-\",Rep_Data!P242))","v":"-"},{"$f":"IF(Rep_Data!Q242 = 0, \"-\",IF(Rep_Data!Q242 = \"\",\"-\",Rep_Data!Q242))","v":"-"},{"$f":"IF(Rep_Data!R242 = 0, \"-\",IF(Rep_Data!R242 = \"\",\"-\",Rep_Data!R242))","v":"-"},null,null,null,null,null,null,null,null,null,null,null,null,null,{"$f":"Table1[[#This Row],[Speciality]]&Table1[[#This Row],[Q1]]","v":"GP-"}]
[null,241,{"$f":"Rep_Data!A243","v":"VERNIA,  KRISTOPHER"},{"$f":"Rep_Data!C243","v":"O68378"},{"$f":"Rep_Data!G243","v":"Paris"},{"$f":"Rep_Data!H243","v":"TN"},{"$f":"Rep_Data!I243","v":"38242"},{"$f":"Rep_Data!J243","v":"GP"},{"$f":"IF(Rep_Data!N243 = 0, \"-\",IF(Rep_Data!N243 = \"\",\"-\",Rep_Data!N243))","v":"-"},{"$f":"IF(Rep_Data!O243 = 0, \"-\",IF(Rep_Data!O243 = \"\",\"-\",Rep_Data!O243))","v":"-"},{"$f":"IF(Rep_Data!P243 = 0, \"-\",IF(Rep_Data!P243 = \"\",\"-\",Rep_Data!P243))","v":"-"},{"$f":"IF(Rep_Data!Q243 = 0, \"-\",IF(Rep_Data!Q243 = \"\",\"-\",Rep_Data!Q243))","v":"-"},{"$f":"IF(Rep_Data!R243 = 0, \"-\",IF(Rep_Data!R243 = \"\",\"-\",Rep_Data!R243))","v":"-"},null,null,null,null,null,null,null,null,null,null,null,null,null,{"$f":"Table1[[#This Row],[Speciality]]&Table1[[#This Row],[Q1]]","v":"GP-"}]
[null,242,{"$f":"Rep_Data!A244","v":"VERNIE,  FELICA"},{"$f":"Rep_Data!C244","v":"O54408"},{"$f":"Rep_Data!G244","v":"Buckley"},{"$f":"Rep_Data!H244","v":"MI"},{"$f":"Rep_Data!I244","v":"49620"},{"$f":"Rep_Data!J244","v":"GP"},{"$f":"IF(Rep_Data!N244 = 0, \"-\",IF(Rep_Data!N244 = \"\",\"-\",Rep_Data!N244))","v":"-"},{"$f":"IF(Rep_Data!O244 = 0, \"-\",IF(Rep_Data!O244 = \"\",\"-\",Rep_Data!O244))","v":"-"},{"$f":"IF(Rep_Data!P244 = 0, \"-\",IF(Rep_Data!P244 = \"\",\"-\",Rep_Data!P244))","v":"-"},{"$f":"IF(Rep_Data!Q244 = 0, \"-\",IF(Rep_Data!Q244 = \"\",\"-\",Rep_Data!Q244))","v":"-"},{"$f":"IF(Rep_Data!R244 = 0, \"-\",IF(Rep_Data!R244 = \"\",\"-\",Rep_Data!R244))","v":"-"},null,null,null,null,null,null,null,null,null,null,null,null,null,{"$f":"Table1[[#This Row],[Speciality]]&Table1[[#This Row],[Q1]]","v":"GP-"}]
[null,243,{"$f":"Rep_Data!A245","v":"VERSIE,  ZACHARY"},{"$f":"Rep_Data!C245","v":"O51548"},{"$f":"Rep_Data!G245","v":"Copper Center"},{"$f":"Rep_Data!H245","v":"AK"},{"$f":"Rep_Data!I245","v":"99573"},{"$f":"Rep_Data!J245","v":"GP"},{"$f":"IF(Rep_Data!N245 = 0, \"-\",IF(Rep_Data!N245 = \"\",\"-\",Rep_Data!N245))","v":"-"},{"$f":"IF(Rep_Data!O245 = 0, \"-\",IF(Rep_Data!O245 = \"\",\"-\",Rep_Data!O245))","v":"-"},{"$f":"IF(Rep_Data!P245 = 0, \"-\",IF(Rep_Data!P245 = \"\",\"-\",Rep_Data!P245))","v":"-"},{"$f":"IF(Rep_Data!Q245 = 0, \"-\",IF(Rep_Data!Q245 = \"\",\"-\",Rep_Data!Q245))","v":"-"},{"$f":"IF(Rep_Data!R245 = 0, \"-\",IF(Rep_Data!R245 = \"\",\"-\",Rep_Data!R245))","v":"-"},null,null,null,null,null,null,null,null,null,null,null,null,null,{"$f":"Table1[[#This Row],[Speciality]]&Table1[[#This Row],[Q1]]","v":"GP-"}]
[null,244,{"$f":"Rep_Data!A246","v":"VIOLA,  LORILEE"},{"$f":"Rep_Data!C246","v":"O71381"},{"$f":"Rep_Data!G246","v":"Plains"},{"$f":"Rep_Data!H246","v":"TX"},{"$f":"Rep_Data!I246","v":"79355"},{"$f":"Rep_Data!J246","v":"Ortho"},{"$f":"IF(Rep_Data!N246 = 0, \"-\",IF(Rep_Data!N246 = \"\",\"-\",Rep_Data!N246))","v":"-"},{"$f":"IF(Rep_Data!O246 = 0, \"-\",IF(Rep_Data!O246 = \"\",\"-\",Rep_Data!O246))","v":"-"},{"$f":"IF(Rep_Data!P246 = 0, \"-\",IF(Rep_Data!P246 = \"\",\"-\",Rep_Data!P246))","v":"-"},{"$f":"IF(Rep_Data!Q246 = 0, \"-\",IF(Rep_Data!Q246 = \"\",\"-\",Rep_Data!Q246))","v":"-"},{"$f":"IF(Rep_Data!R246 = 0, \"-\",IF(Rep_Data!R246 = \"\",\"-\",Rep_Data!R246))","v":"-"},null,null,null,null,null,null,null,null,null,null,null,null,null,{"$f":"Table1[[#This Row],[Speciality]]&Table1[[#This Row],[Q1]]","v":"Ortho-"}]
[null,245,{"$f":"Rep_Data!A247","v":"WALTON,  TAD"},{"$f":"Rep_Data!C247","v":"O51679"},{"$f":"Rep_Data!G247","v":"Calpella"},{"$f":"Rep_Data!H247","v":"CA"},{"$f":"Rep_Data!I247","v":"95418"},{"$f":"Rep_Data!J247","v":"Ortho"},{"$f":"IF(Rep_Data!N247 = 0, \"-\",IF(Rep_Data!N247 = \"\",\"-\",Rep_Data!N247))","v":"-"},{"$f":"IF(Rep_Data!O247 = 0, \"-\",IF(Rep_Data!O247 = \"\",\"-\",Rep_Data!O247))","v":"-"},{"$f":"IF(Rep_Data!P247 = 0, \"-\",IF(Rep_Data!P247 = \"\",\"-\",Rep_Data!P247))","v":"-"},{"$f":"IF(Rep_Data!Q247 = 0, \"-\",IF(Rep_Data!Q247 = \"\",\"-\",Rep_Data!Q247))","v":"-"},{"$f":"IF(Rep_Data!R247 = 0, \"-\",IF(Rep_Data!R247 = \"\",\"-\",Rep_Data!R247))","v":"-"},null,null,null,null,null,null,null,null,null,null,null,null,null,{"$f":"Table1[[#This Row],[Speciality]]&Table1[[#This Row],[Q1]]","v":"Ortho-"}]
[null,246,{"$f":"Rep_Data!A248","v":"WAN,  SHIRLEEN"},{"$f":"Rep_Data!C248","v":"O79950"},{"$f":"Rep_Data!G248","v":"Rosanky"},{"$f":"Rep_Data!H248","v":"TX"},{"$f":"Rep_Data!I248","v":"78953"},{"$f":"Rep_Data!J248","v":"Ortho"},{"$f":"IF(Rep_Data!N248 = 0, \"-\",IF(Rep_Data!N248 = \"\",\"-\",Rep_Data!N248))","v":"YES"},{"$f":"IF(Rep_Data!O248 = 0, \"-\",IF(Rep_Data!O248 = \"\",\"-\",Rep_Data!O248))","v":"1 - 2"},{"$f":"IF(Rep_Data!P248 = 0, \"-\",IF(Rep_Data!P248 = \"\",\"-\",Rep_Data!P248))","v":"1 - 3"},{"$f":"IF(Rep_Data!Q248 = 0, \"-\",IF(Rep_Data!Q248 = \"\",\"-\",Rep_Data!Q248))","v":"1"},{"$f":"IF(Rep_Data!R248 = 0, \"-\",IF(Rep_Data!R248 = \"\",\"-\",Rep_Data!R248))","v":"2 or Less"},null,null,null,null,null,null,null,null,null,null,null,null,null,{"$f":"Table1[[#This Row],[Speciality]]&Table1[[#This Row],[Q1]]","v":"OrthoYES"}]
[null,247,{"$f":"Rep_Data!A249","v":"YASMINE,  JOHN"},{"$f":"Rep_Data!C249","v":"O50941"},{"$f":"Rep_Data!G249","v":"Pacific"},{"$f":"Rep_Data!H249","v":"MO"},{"$f":"Rep_Data!I249","v":"63069"},{"$f":"Rep_Data!J249","v":"Surgery"},{"$f":"IF(Rep_Data!N249 = 0, \"-\",IF(Rep_Data!N249 = \"\",\"-\",Rep_Data!N249))","v":"-"},{"$f":"IF(Rep_Data!O249 = 0, \"-\",IF(Rep_Data!O249 = \"\",\"-\",Rep_Data!O249))","v":"-"},{"$f":"IF(Rep_Data!P249 = 0, \"-\",IF(Rep_Data!P249 = \"\",\"-\",Rep_Data!P249))","v":"-"},{"$f":"IF(Rep_Data!Q249 = 0, \"-\",IF(Rep_Data!Q249 = \"\",\"-\",Rep_Data!Q249))","v":"-"},{"$f":"IF(Rep_Data!R249 = 0, \"-\",IF(Rep_Data!R249 = \"\",\"-\",Rep_Data!R249))","v":"-"},null,null,null,null,null,null,null,null,null,null,null,null,null,{"$f":"Table1[[#This Row],[Speciality]]&Table1[[#This Row],[Q1]]","v":"Surgery-"}]
[null,248,{"$f":"Rep_Data!A250","v":"ZETTA,  ROLF"},{"$f":"Rep_Data!C250","v":"O74758"},{"$f":"Rep_Data!G250","v":"Beauty"},{"$f":"Rep_Data!H250","v":"KY"},{"$f":"Rep_Data!I250","v":"41203"},{"$f":"Rep_Data!J250","v":"GP"},{"$f":"IF(Rep_Data!N250 = 0, \"-\",IF(Rep_Data!N250 = \"\",\"-\",Rep_Data!N250))","v":"YES"},{"$f":"IF(Rep_Data!O250 = 0, \"-\",IF(Rep_Data!O250 = \"\",\"-\",Rep_Data!O250))","v":"NONE"},{"$f":"IF(Rep_Data!P250 = 0, \"-\",IF(Rep_Data!P250 = \"\",\"-\",Rep_Data!P250))","v":"1 - 3"},{"$f":"IF(Rep_Data!Q250 = 0, \"-\",IF(Rep_Data!Q250 = \"\",\"-\",Rep_Data!Q250))","v":"2 - 3"},{"$f":"IF(Rep_Data!R250 = 0, \"-\",IF(Rep_Data!R250 = \"\",\"-\",Rep_Data!R250))","v":"2 or Less"},null,null,null,null,null,null,null,null,null,null,null,null,null,{"$f":"Table1[[#This Row],[Speciality]]&Table1[[#This Row],[Q1]]","v":"GPYES"}]
[null,249,{"$f":"Rep_Data!A251","v":"ZOE,  ADELA"},{"$f":"Rep_Data!C251","v":"O78290"},{"$f":"Rep_Data!G251","v":"Forreston"},{"$f":"Rep_Data!H251","v":"IL"},{"$f":"Rep_Data!I251","v":"61030"},{"$f":"Rep_Data!J251","v":"GP"},{"$f":"IF(Rep_Data!N251 = 0, \"-\",IF(Rep_Data!N251 = \"\",\"-\",Rep_Data!N251))","v":"-"},{"$f":"IF(Rep_Data!O251 = 0, \"-\",IF(Rep_Data!O251 = \"\",\"-\",Rep_Data!O251))","v":"-"},{"$f":"IF(Rep_Data!P251 = 0, \"-\",IF(Rep_Data!P251 = \"\",\"-\",Rep_Data!P251))","v":"-"},{"$f":"IF(Rep_Data!Q251 = 0, \"-\",IF(Rep_Data!Q251 = \"\",\"-\",Rep_Data!Q251))","v":"-"},{"$f":"IF(Rep_Data!R251 = 0, \"-\",IF(Rep_Data!R251 = \"\",\"-\",Rep_Data!R251))","v":"-"},null,null,null,null,null,null,null,null,null,null,null,null,null,{"$f":"Table1[[#This Row],[Speciality]]&Table1[[#This Row],[Q1]]","v":"GP-"}]
[null,250,{"$f":"Rep_Data!A252","v":"ZORA,  LAWRENCE"},{"$f":"Rep_Data!C252","v":"O56721"},{"$f":"Rep_Data!G252","v":"Ace"},{"$f":"Rep_Data!H252","v":"TX"},{"$f":"Rep_Data!I252","v":"77326"},{"$f":"Rep_Data!J252","v":"Ortho"},{"$f":"IF(Rep_Data!N252 = 0, \"-\",IF(Rep_Data!N252 = \"\",\"-\",Rep_Data!N252))","v":"-"},{"$f":"IF(Rep_Data!O252 = 0, \"-\",IF(Rep_Data!O252 = \"\",\"-\",Rep_Data!O252))","v":"-"},{"$f":"IF(Rep_Data!P252 = 0, \"-\",IF(Rep_Data!P252 = \"\",\"-\",Rep_Data!P252))","v":"-"},{"$f":"IF(Rep_Data!Q252 = 0, \"-\",IF(Rep_Data!Q252 = \"\",\"-\",Rep_Data!Q252))","v":"-"},{"$f":"IF(Rep_Data!R252 = 0, \"-\",IF(Rep_Data!R252 = \"\",\"-\",Rep_Data!R252))","v":"-"},null,null,null,null,null,null,null,null,null,null,null,null,null,{"$f":"Table1[[#This Row],[Speciality]]&Table1[[#This Row],[Q1]]","v":"Ortho-"}]