{"text_format":"1","workbook":"xlsx","n_sheets":4,"sheets":["Front","Rep_Data","Calculate","Summary"],"not_rendered":{"charts":4,"images":19,"macros":1,"external_links":0,"defined_names":0,"comments":0,"pivot_tables":0},"unopened":[],"bounds":{"document_bytes":16777216,"sheet_cells":100000,"rows_first":2000,"rows_last":500,"rows_between":2000,"halvings":0,"cell_chars":16384,"cell_head_chars":4096},"cells_cut":0,"cells_raw":0,"read":"whole","date_system":"1900"}

{"sheet":"Front","index":0,"n_rows":12,"n_cols":26,"rows_kept":12,"cut":false,"hidden":false,"merged":[]}
[]
[]
[]
[]
[null,null,null,null,null,null,null,null,null,null,null,null,null,null,null,null,null,null,null,null,null,null,null,null,"Name",{"$f":"Calculate!D3&\"  \" &Calculate!E3","v":"DOMITILA  AARON"}]
[null,null,null,null,null,null,null,null,null,null,null,null,null,null,null,null,null,null,null,null,null,null,null,null,"Address",{"$f":"Calculate!F3","v":"4605 Patti St"}]
[null,null,null,null,null,null,null,null,null,null,null,null,null,null,null,null,null,null,null,null,null,null,null,null,"City",{"$f":"Calculate!G3&\",  \"&Calculate!H3","v":"Hampton,  VA"}]
[null,null,null,null,null,null,null,null,null,null,null,null,null,null,null,null,null,null,null,null,null,null,null,null,"Pincode",{"$f":"Calculate!I3","v":"23681"}]
[]
[null,null,null,null,null,null,null,null,null,null,null,null,null,null,null,null,null,null,null,null,null,null,null,null,null,{"$f":"\" Questionnaire for Physician  -  \"&Z5","v":" Questionnaire for Physician  -  DOMITILA  AARON"}]
[]
[null,null,null,null,null,null,null,null,null,null,null,null,null,null,null,null,null,null,null,null,null,null,null,null,null,"& \"  (\"&Calculate!J3&\")\""]

{"sheet":"Rep_Data","index":1,"n_rows":252,"n_cols":18,"rows_kept":252,"cut":false,"hidden":true,"merged":[]}
[]
["Physician Name","Name of the Rep","Physician ID","First Name","Last Name","Street Address 1"," City"," State"," Zip","Speciality","Physician Name",null,null,"Q1","Q2","Q3","Q4","Q5"]
["AARON,  DOMITILA","Barbara Green","O65016","DOMITILA","AARON","4605 Patti St","Hampton","VA","23681","GP","AARON,  DOMITILA",null,null,"NO","NONE","NONE","1","2 or Less"]
["ABIGAIL,  JAMISON","Barbara Green","O76771","JAMISON","ABIGAIL","1397 Stepanie Wy","Ferndale","FL","34729","GP","ABIGAIL,  JAMISON",null,null,"","","","",""]
["AI,  LAKEESHA","Barbara Green","O68016","LAKEESHA","AI","2851 Twyla Ave","Boca Raton","FL","33428","Ortho","AI,  LAKEESHA",null,null,"","","","",""]
["ALBERT,  ALI","Barbara Green","O65520","ALI","ALBERT","3708 Tifany Ave","Stockbridge","GA","30281","GP","ALBERT,  ALI",null,null,"YES","3 - 4","3 - 5","2 - 3","2 or Less"]
["ALBERTHA,  BRIGETTE","Barbara Green","O58834","BRIGETTE","ALBERTHA","601 Ivy St","Bridgeton","IN","47836","Surgery","ALBERTHA,  BRIGETTE",null,null,"YES","3 - 4","1 - 3","More than 3","More than 2"]
["ALISA,  KRYSTYNA","Barbara Green","O59647","KRYSTYNA","ALISA","1749 169th St","Greenwood Springs","MS","38848","GP","ALISA,  KRYSTYNA"]
["ALTON,  THANH","Barbara Green","O61755","THANH","ALTON","930 193rd St","Summitville","NY","12781","Ortho","ALTON,  THANH",null,null,"YES","3 - 4","3 - 5","2 - 3","More than 2"]
["ALVINA,  ERNIE","Barbara Green","O71265","ERNIE","ALVINA","845 268th St","Wilton","CT","06897","GP","ALVINA,  ERNIE"]
["ALYSIA,  SHERILYN","Barbara Green","O63685","SHERILYN","ALYSIA","3402 Alanna Ave","Earth","TX","79031","GP","ALYSIA,  SHERILYN"]
["ANDRE,  YVONNE","Barbara Green","O63747","YVONNE","ANDRE","2640 229th Ave","Independence","MO","64056","Surgery","ANDRE,  YVONNE",null,null,"NO","3 - 4","1 - 3","2 - 3","2 or Less"]
["ANDREA,  NICKIE","Barbara Green","O79689","NICKIE","ANDREA","Offc 11I, 3205 272nd Ave","Bathgate","ND","58216","Surgery","ANDREA,  NICKIE",null,null,"NO","1 - 2","NONE","2 - 3","More than 2"]
["ANGELO,  SHONDRA","Barbara Green","O75260","SHONDRA","ANGELO","3590 Adam Ave","Kansas City","MO","64110","Ortho","ANGELO,  SHONDRA",null,null,"YES","1 - 2","NONE","1","2 or Less"]
["ANITRA,  STEPANIE","Barbara Green","O61474","STEPANIE","ANITRA","2110 281st St","Pacific Grove","CA","93950","GP","ANITRA,  STEPANIE"]
["ANTIONE,  MARC","Barbara Green","O79277","MARC","ANTIONE","354 209th Ave","Sugar Valley","GA","30746","Surgery","ANTIONE,  MARC",null,null,"YES","1 - 2","NONE","2 - 3","More than 2"]
["ANTONIO,  ROSALYN","Barbara Green","O53142","ROSALYN","ANTONIO","3528 Sharon Ave","Aurora","CO","80014","GP","ANTONIO,  ROSALYN"]
["ASHA,  KUM","Barbara Green","O79730","KUM","ASHA","4141 Dung St","Norwood","MN","55383","Ortho","ASHA,  KUM"]
["AUDIE,  AUGUST","Barbara Green","O57841","AUGUST","AUDIE","1952 Doug Trnpk","Ocate","NM","87734","GP","AUDIE,  AUGUST",null,null,"YES","3 - 4","1 - 3","More than 3","More than 2"]
["AUGUSTA,  KIMBERLEE","Barbara Green","O60307","KIMBERLEE","AUGUSTA","955 Faith Ave","Canada","KY","41519","GP","AUGUSTA,  KIMBERLEE",null,null,"YES","1 - 2","NONE","1","2 or Less"]
{"$rows_left_out":233}
{"sheet":"Calculate","index":2,"n_rows":25,"n_cols":19,"rows_kept":25,"cut":false,"hidden":true,"merged":[]}
[null,null,null,null,null,null,null,null,null,null,null,{"$f":"\"Rep_Data!N\"&Calculate!$K$3&\":R\"&Calculate!$K$3","v":"Rep_Data!N3:R3"}]
["Physician Name","Name of the Rep","Physician ID","First Name","Last Name","Street Address 1"," City"," State"," Zip","Speciality","Row No","Filled ",null,null,"Q1","Q2","Q3","Q4","Q5"]
["AARON,  DOMITILA",{"$f":"VLOOKUP($A3,Rep_Data!$A$3:$J$252,2,0)","v":"Barbara Green"},{"$f":"VLOOKUP($A3,Rep_Data!$A$3:$J$252,3,0)","v":"O65016"},{"$f":"VLOOKUP($A3,Rep_Data!$A$3:$J$252,4,0)","v":"DOMITILA"},{"$f":"VLOOKUP($A3,Rep_Data!$A$3:$J$252,5,0)","v":"AARON"},{"$f":"VLOOKUP($A3,Rep_Data!$A$3:$J$252,6,0)","v":"4605 Patti St"},{"$f":"VLOOKUP($A3,Rep_Data!$A$3:$J$252,7,0)","v":"Hampton"},{"$f":"VLOOKUP($A3,Rep_Data!$A$3:$J$252,8,0)","v":"VA"},{"$f":"VLOOKUP($A3,Rep_Data!$A$3:$J$252,9,0)","v":"23681"},{"$f":"VLOOKUP($A3,Rep_Data!$A$3:$J$252,10,0)","v":"GP"},{"$f":"MATCH(A3,Rep_Data!$A$3:$A$252) +2","v":3},{"$f":"IF(O3=\"\",0,COUNTA(INDIRECT(L1)))","v":5},null,null,{"$f":"VLOOKUP($A3,Rep_Data!$A$3:$R$252,14,0)","v":"NO"},{"$f":"VLOOKUP($A3,Rep_Data!$A$3:$R$252,15,0)","v":"NONE"},{"$f":"VLOOKUP($A3,Rep_Data!$A$3:$R$252,16,0)","v":"NONE"},{"$f":"VLOOKUP($A3,Rep_Data!$A$3:$R$252,17,0)","v":"1"},{"$f":"VLOOKUP($A3,Rep_Data!$A$3:$R$252,18,0)","v":"2 or Less"}]
[]
[]
[]
[]
[]
[]
[]
[]
[]
[]
[]
[]
[]
[{"$f":"COUNTIF($A$18:$E$18,\"SELECT\")","v":0}]
["NO","NONE","NONE","1","2 or Less",null,null,"All","GP","Ortho","Surgery"]
[null,null,null,null,null,null,"Total",{"$f":"COUNTA(Table1[Physician Name])","v":250},{"$f":"COUNTIF(Table1[Speciality],Calculate!I$18)","v":155},{"$f":"COUNTIF(Table1[Speciality],Calculate!J$18)","v":52},{"$f":"COUNTIF(Table1[Speciality],Calculate!K$18)","v":43}]
["Q1","Q2","Q3","Q4","Q5",null,"Filled",{"$f":"H19-H21","v":47},{"$f":"I19-I21","v":27},11,9]
{"$rows_left_out":6}
{"sheet":"Summary","index":3,"n_rows":253,"n_cols":27,"rows_kept":253,"cut":false,"hidden":false,"merged":[[1,8,1,12]]}
[]
[null,null,null,null,null,null,null,null,"RESPONSES TO THE QUESTIONNAIRE"]
[null,"S. No","Physician Name","Physician ID"," City"," State"," Zip","Speciality","Q1","Q2","Q3","Q4","Q5"]
[null,1,{"$f":"Rep_Data!A3","v":"AARON,  DOMITILA"},{"$f":"Rep_Data!C3","v":"O65016"},{"$f":"Rep_Data!G3","v":"Hampton"},{"$f":"Rep_Data!H3","v":"VA"},{"$f":"Rep_Data!I3","v":"23681"},{"$f":"Rep_Data!J3","v":"GP"},{"$f":"IF(Rep_Data!N3 = 0, \"-\",IF(Rep_Data!N3 = \"\",\"-\",Rep_Data!N3))","v":"NO"},{"$f":"IF(Rep_Data!O3 = 0, \"-\",IF(Rep_Data!O3 = \"\",\"-\",Rep_Data!O3))","v":"NONE"},{"$f":"IF(Rep_Data!P3 = 0, \"-\",IF(Rep_Data!P3 = \"\",\"-\",Rep_Data!P3))","v":"NONE"},{"$f":"IF(Rep_Data!Q3 = 0, \"-\",IF(Rep_Data!Q3 = \"\",\"-\",Rep_Data!Q3))","v":"1"},{"$f":"IF(Rep_Data!R3 = 0, \"-\",IF(Rep_Data!R3 = \"\",\"-\",Rep_Data!R3))","v":"2 or Less"},null,null,null,null,null,null,null,null,null,null,null,null,null,{"$f":"Table1[[#This Row],[Speciality]]&Table1[[#This Row],[Q1]]","v":"GPNO"}]
[null,2,{"$f":"Rep_Data!A4","v":"ABIGAIL,  JAMISON"},{"$f":"Rep_Data!C4","v":"O76771"},{"$f":"Rep_Data!G4","v":"Ferndale"},{"$f":"Rep_Data!H4","v":"FL"},{"$f":"Rep_Data!I4","v":"34729"},{"$f":"Rep_Data!J4","v":"GP"},{"$f":"IF(Rep_Data!N4 = 0, \"-\",IF(Rep_Data!N4 = \"\",\"-\",Rep_Data!N4))","v":"-"},{"$f":"IF(Rep_Data!O4 = 0, \"-\",IF(Rep_Data!O4 = \"\",\"-\",Rep_Data!O4))","v":"-"},{"$f":"IF(Rep_Data!P4 = 0, \"-\",IF(Rep_Data!P4 = \"\",\"-\",Rep_Data!P4))","v":"-"},{"$f":"IF(Rep_Data!Q4 = 0, \"-\",IF(Rep_Data!Q4 = \"\",\"-\",Rep_Data!Q4))","v":"-"},{"$f":"IF(Rep_Data!R4 = 0, \"-\",IF(Rep_Data!R4 = \"\",\"-\",Rep_Data!R4))","v":"-"},null,null,null,null,null,null,null,null,null,null,null,null,null,{"$f":"Table1[[#This Row],[Speciality]]&Table1[[#This Row],[Q1]]","v":"GP-"}]
[null,3,{"$f":"Rep_Data!A5","v":"AI,  LAKEESHA"},{"$f":"Rep_Data!C5","v":"O68016"},{"$f":"Rep_Data!G5","v":"Boca Raton"},{"$f":"Rep_Data!H5","v":"FL"},{"$f":"Rep_Data!I5","v":"33428"},{"$f":"Rep_Data!J5","v":"Ortho"},{"$f":"IF(Rep_Data!N5 = 0, \"-\",IF(Rep_Data!N5 = \"\",\"-\",Rep_Data!N5))","v":"-"},{"$f":"IF(Rep_Data!O5 = 0, \"-\",IF(Rep_Data!O5 = \"\",\"-\",Rep_Data!O5))","v":"-"},{"$f":"IF(Rep_Data!P5 = 0, \"-\",IF(Rep_Data!P5 = \"\",\"-\",Rep_Data!P5))","v":"-"},{"$f":"IF(Rep_Data!Q5 = 0, \"-\",IF(Rep_Data!Q5 = \"\",\"-\",Rep_Data!Q5))","v":"-"},{"$f":"IF(Rep_Data!R5 = 0, \"-\",IF(Rep_Data!R5 = \"\",\"-\",Rep_Data!R5))","v":"-"},null,null,null,null,null,null,null,null,null,null,null,null,null,{"$f":"Table1[[#This Row],[Speciality]]&Table1[[#This Row],[Q1]]","v":"Ortho-"}]
[null,4,{"$f":"Rep_Data!A6","v":"ALBERT,  ALI"},{"$f":"Rep_Data!C6","v":"O65520"},{"$f":"Rep_Data!G6","v":"Stockbridge"},{"$f":"Rep_Data!H6","v":"GA"},{"$f":"Rep_Data!I6","v":"30281"},{"$f":"Rep_Data!J6","v":"GP"},{"$f":"IF(Rep_Data!N6 = 0, \"-\",IF(Rep_Data!N6 = \"\",\"-\",Rep_Data!N6))","v":"YES"},{"$f":"IF(Rep_Data!O6 = 0, \"-\",IF(Rep_Data!O6 = \"\",\"-\",Rep_Data!O6))","v":"3 - 4"},{"$f":"IF(Rep_Data!P6 = 0, \"-\",IF(Rep_Data!P6 = \"\",\"-\",Rep_Data!P6))","v":"3 - 5"},{"$f":"IF(Rep_Data!Q6 = 0, \"-\",IF(Rep_Data!Q6 = \"\",\"-\",Rep_Data!Q6))","v":"2 - 3"},{"$f":"IF(Rep_Data!R6 = 0, \"-\",IF(Rep_Data!R6 = \"\",\"-\",Rep_Data!R6))","v":"2 or Less"},null,null,null,null,null,null,null,null,null,null,null,null,null,{"$f":"Table1[[#This Row],[Speciality]]&Table1[[#This Row],[Q1]]","v":"GPYES"}]
[null,5,{"$f":"Rep_Data!A7","v":"ALBERTHA,  BRIGETTE"},{"$f":"Rep_Data!C7","v":"O58834"},{"$f":"Rep_Data!G7","v":"Bridgeton"},{"$f":"Rep_Data!H7","v":"IN"},{"$f":"Rep_Data!I7","v":"47836"},{"$f":"Rep_Data!J7","v":"Surgery"},{"$f":"IF(Rep_Data!N7 = 0, \"-\",IF(Rep_Data!N7 = \"\",\"-\",Rep_Data!N7))","v":"YES"},{"$f":"IF(Rep_Data!O7 = 0, \"-\",IF(Rep_Data!O7 = \"\",\"-\",Rep_Data!O7))","v":"3 - 4"},{"$f":"IF(Rep_Data!P7 = 0, \"-\",IF(Rep_Data!P7 = \"\",\"-\",Rep_Data!P7))","v":"1 - 3"},{"$f":"IF(Rep_Data!Q7 = 0, \"-\",IF(Rep_Data!Q7 = \"\",\"-\",Rep_Data!Q7))","v":"More than 3"},{"$f":"IF(Rep_Data!R7 = 0, \"-\",IF(Rep_Data!R7 = \"\",\"-\",Rep_Data!R7))","v":"More than 2"},null,null,null,null,null,null,null,null,null,null,null,null,null,{"$f":"Table1[[#This Row],[Speciality]]&Table1[[#This Row],[Q1]]","v":"SurgeryYES"}]
[null,6,{"$f":"Rep_Data!A8","v":"ALISA,  KRYSTYNA"},{"$f":"Rep_Data!C8","v":"O59647"},{"$f":"Rep_Data!G8","v":"Greenwood Springs"},{"$f":"Rep_Data!H8","v":"MS"},{"$f":"Rep_Data!I8","v":"38848"},{"$f":"Rep_Data!J8","v":"GP"},{"$f":"IF(Rep_Data!N8 = 0, \"-\",IF(Rep_Data!N8 = \"\",\"-\",Rep_Data!N8))","v":"-"},{"$f":"IF(Rep_Data!O8 = 0, \"-\",IF(Rep_Data!O8 = \"\",\"-\",Rep_Data!O8))","v":"-"},{"$f":"IF(Rep_Data!P8 = 0, \"-\",IF(Rep_Data!P8 = \"\",\"-\",Rep_Data!P8))","v":"-"},{"$f":"IF(Rep_Data!Q8 = 0, \"-\",IF(Rep_Data!Q8 = \"\",\"-\",Rep_Data!Q8))","v":"-"},{"$f":"IF(Rep_Data!R8 = 0, \"-\",IF(Rep_Data!R8 = \"\",\"-\",Rep_Data!R8))","v":"-"},null,null,null,null,null,null,null,null,null,null,null,null,null,{"$f":"Table1[[#This Row],[Speciality]]&Table1[[#This Row],[Q1]]","v":"GP-"}]
[null,7,{"$f":"Rep_Data!A9","v":"ALTON,  THANH"},{"$f":"Rep_Data!C9","v":"O61755"},{"$f":"Rep_Data!G9","v":"Summitville"},{"$f":"Rep_Data!H9","v":"NY"},{"$f":"Rep_Data!I9","v":"12781"},{"$f":"Rep_Data!J9","v":"Ortho"},{"$f":"IF(Rep_Data!N9 = 0, \"-\",IF(Rep_Data!N9 = \"\",\"-\",Rep_Data!N9))","v":"YES"},{"$f":"IF(Rep_Data!O9 = 0, \"-\",IF(Rep_Data!O9 = \"\",\"-\",Rep_Data!O9))","v":"3 - 4"},{"$f":"IF(Rep_Data!P9 = 0, \"-\",IF(Rep_Data!P9 = \"\",\"-\",Rep_Data!P9))","v":"3 - 5"},{"$f":"IF(Rep_Data!Q9 = 0, \"-\",IF(Rep_Data!Q9 = \"\",\"-\",Rep_Data!Q9))","v":"2 - 3"},{"$f":"IF(Rep_Data!R9 = 0, \"-\",IF(Rep_Data!R9 = \"\",\"-\",Rep_Data!R9))","v":"More than 2"},null,null,null,null,null,null,null,null,null,null,null,null,null,{"$f":"Table1[[#This Row],[Speciality]]&Table1[[#This Row],[Q1]]","v":"OrthoYES"}]
[null,8,{"$f":"Rep_Data!A10","v":"ALVINA,  ERNIE"},{"$f":"Rep_Data!C10","v":"O71265"},{"$f":"Rep_Data!G10","v":"Wilton"},{"$f":"Rep_Data!H10","v":"CT"},{"$f":"Rep_Data!I10","v":"06897"},{"$f":"Rep_Data!J10","v":"GP"},{"$f":"IF(Rep_Data!N10 = 0, \"-\",IF(Rep_Data!N10 = \"\",\"-\",Rep_Data!N10))","v":"-"},{"$f":"IF(Rep_Data!O10 = 0, \"-\",IF(Rep_Data!O10 = \"\",\"-\",Rep_Data!O10))","v":"-"},{"$f":"IF(Rep_Data!P10 = 0, \"-\",IF(Rep_Data!P10 = \"\",\"-\",Rep_Data!P10))","v":"-"},{"$f":"IF(Rep_Data!Q10 = 0, \"-\",IF(Rep_Data!Q10 = \"\",\"-\",Rep_Data!Q10))","v":"-"},{"$f":"IF(Rep_Data!R10 = 0, \"-\",IF(Rep_Data!R10 = \"\",\"-\",Rep_Data!R10))","v":"-"},null,null,null,null,null,null,null,null,null,null,null,null,null,{"$f":"Table1[[#This Row],[Speciality]]&Table1[[#This Row],[Q1]]","v":"GP-"}]
[null,9,{"$f":"Rep_Data!A11","v":"ALYSIA,  SHERILYN"},{"$f":"Rep_Data!C11","v":"O63685"},{"$f":"Rep_Data!G11","v":"Earth"},{"$f":"Rep_Data!H11","v":"TX"},{"$f":"Rep_Data!I11","v":"79031"},{"$f":"Rep_Data!J11","v":"GP"},{"$f":"IF(Rep_Data!N11 = 0, \"-\",IF(Rep_Data!N11 = \"\",\"-\",Rep_Data!N11))","v":"-"},{"$f":"IF(Rep_Data!O11 = 0, \"-\",IF(Rep_Data!O11 = \"\",\"-\",Rep_Data!O11))","v":"-"},{"$f":"IF(Rep_Data!P11 = 0, \"-\",IF(Rep_Data!P11 = \"\",\"-\",Rep_Data!P11))","v":"-"},{"$f":"IF(Rep_Data!Q11 = 0, \"-\",IF(Rep_Data!Q11 = \"\",\"-\",Rep_Data!Q11))","v":"-"},{"$f":"IF(Rep_Data!R11 = 0, \"-\",IF(Rep_Data!R11 = \"\",\"-\",Rep_Data!R11))","v":"-"},null,null,null,null,null,null,null,null,null,null,null,null,null,{"$f":"Table1[[#This Row],[Speciality]]&Table1[[#This Row],[Q1]]","v":"GP-"}]
[null,10,{"$f":"Rep_Data!A12","v":"ANDRE,  YVONNE"},{"$f":"Rep_Data!C12","v":"O63747"},{"$f":"Rep_Data!G12","v":"Independence"},{"$f":"Rep_Data!H12","v":"MO"},{"$f":"Rep_Data!I12","v":"64056"},{"$f":"Rep_Data!J12","v":"Surgery"},{"$f":"IF(Rep_Data!N12 = 0, \"-\",IF(Rep_Data!N12 = \"\",\"-\",Rep_Data!N12))","v":"NO"},{"$f":"IF(Rep_Data!O12 = 0, \"-\",IF(Rep_Data!O12 = \"\",\"-\",Rep_Data!O12))","v":"3 - 4"},{"$f":"IF(Rep_Data!P12 = 0, \"-\",IF(Rep_Data!P12 = \"\",\"-\",Rep_Data!P12))","v":"1 - 3"},{"$f":"IF(Rep_Data!Q12 = 0, \"-\",IF(Rep_Data!Q12 = \"\",\"-\",Rep_Data!Q12))","v":"2 - 3"},{"$f":"IF(Rep_Data!R12 = 0, \"-\",IF(Rep_Data!R12 = \"\",\"-\",Rep_Data!R12))","v":"2 or Less"},null,null,null,null,null,null,null,null,null,null,null,null,null,{"$f":"Table1[[#This Row],[Speciality]]&Table1[[#This Row],[Q1]]","v":"SurgeryNO"}]
[null,11,{"$f":"Rep_Data!A13","v":"ANDREA,  NICKIE"},{"$f":"Rep_Data!C13","v":"O79689"},{"$f":"Rep_Data!G13","v":"Bathgate"},{"$f":"Rep_Data!H13","v":"ND"},{"$f":"Rep_Data!I13","v":"58216"},{"$f":"Rep_Data!J13","v":"Surgery"},{"$f":"IF(Rep_Data!N13 = 0, \"-\",IF(Rep_Data!N13 = \"\",\"-\",Rep_Data!N13))","v":"NO"},{"$f":"IF(Rep_Data!O13 = 0, \"-\",IF(Rep_Data!O13 = \"\",\"-\",Rep_Data!O13))","v":"1 - 2"},{"$f":"IF(Rep_Data!P13 = 0, \"-\",IF(Rep_Data!P13 = \"\",\"-\",Rep_Data!P13))","v":"NONE"},{"$f":"IF(Rep_Data!Q13 = 0, \"-\",IF(Rep_Data!Q13 = \"\",\"-\",Rep_Data!Q13))","v":"2 - 3"},{"$f":"IF(Rep_Data!R13 = 0, \"-\",IF(Rep_Data!R13 = \"\",\"-\",Rep_Data!R13))","v":"More than 2"},null,null,null,null,null,null,null,null,null,null,null,null,null,{"$f":"Table1[[#This Row],[Speciality]]&Table1[[#This Row],[Q1]]","v":"SurgeryNO"}]
[null,12,{"$f":"Rep_Data!A14","v":"ANGELO,  SHONDRA"},{"$f":"Rep_Data!C14","v":"O75260"},{"$f":"Rep_Data!G14","v":"Kansas City"},{"$f":"Rep_Data!H14","v":"MO"},{"$f":"Rep_Data!I14","v":"64110"},{"$f":"Rep_Data!J14","v":"Ortho"},{"$f":"IF(Rep_Data!N14 = 0, \"-\",IF(Rep_Data!N14 = \"\",\"-\",Rep_Data!N14))","v":"YES"},{"$f":"IF(Rep_Data!O14 = 0, \"-\",IF(Rep_Data!O14 = \"\",\"-\",Rep_Data!O14))","v":"1 - 2"},{"$f":"IF(Rep_Data!P14 = 0, \"-\",IF(Rep_Data!P14 = \"\",\"-\",Rep_Data!P14))","v":"NONE"},{"$f":"IF(Rep_Data!Q14 = 0, \"-\",IF(Rep_Data!Q14 = \"\",\"-\",Rep_Data!Q14))","v":"1"},{"$f":"IF(Rep_Data!R14 = 0, \"-\",IF(Rep_Data!R14 = \"\",\"-\",Rep_Data!R14))","v":"2 or Less"},null,null,null,null,null,null,null,null,null,null,null,null,null,{"$f":"Table1[[#This Row],[Speciality]]&Table1[[#This Row],[Q1]]","v":"OrthoYES"}]
[null,13,{"$f":"Rep_Data!A15","v":"ANITRA,  STEPANIE"},{"$f":"Rep_Data!C15","v":"O61474"},{"$f":"Rep_Data!G15","v":"Pacific Grove"},{"$f":"Rep_Data!H15","v":"CA"},{"$f":"Rep_Data!I15","v":"93950"},{"$f":"Rep_Data!J15","v":"GP"},{"$f":"IF(Rep_Data!N15 = 0, \"-\",IF(Rep_Data!N15 = \"\",\"-\",Rep_Data!N15))","v":"-"},{"$f":"IF(Rep_Data!O15 = 0, \"-\",IF(Rep_Data!O15 = \"\",\"-\",Rep_Data!O15))","v":"-"},{"$f":"IF(Rep_Data!P15 = 0, \"-\",IF(Rep_Data!P15 = \"\",\"-\",Rep_Data!P15))","v":"-"},{"$f":"IF(Rep_Data!Q15 = 0, \"-\",IF(Rep_Data!Q15 = \"\",\"-\",Rep_Data!Q15))","v":"-"},{"$f":"IF(Rep_Data!R15 = 0, \"-\",IF(Rep_Data!R15 = \"\",\"-\",Rep_Data!R15))","v":"-"},null,null,null,null,null,null,null,null,null,null,null,null,null,{"$f":"Table1[[#This Row],[Speciality]]&Table1[[#This Row],[Q1]]","v":"GP-"}]
[null,14,{"$f":"Rep_Data!A16","v":"ANTIONE,  MARC"},{"$f":"Rep_Data!C16","v":"O79277"},{"$f":"Rep_Data!G16","v":"Sugar Valley"},{"$f":"Rep_Data!H16","v":"GA"},{"$f":"Rep_Data!I16","v":"30746"},{"$f":"Rep_Data!J16","v":"Surgery"},{"$f":"IF(Rep_Data!N16 = 0, \"-\",IF(Rep_Data!N16 = \"\",\"-\",Rep_Data!N16))","v":"YES"},{"$f":"IF(Rep_Data!O16 = 0, \"-\",IF(Rep_Data!O16 = \"\",\"-\",Rep_Data!O16))","v":"1 - 2"},{"$f":"IF(Rep_Data!P16 = 0, \"-\",IF(Rep_Data!P16 = \"\",\"-\",Rep_Data!P16))","v":"NONE"},{"$f":"IF(Rep_Data!Q16 = 0, \"-\",IF(Rep_Data!Q16 = \"\",\"-\",Rep_Data!Q16))","v":"2 - 3"},{"$f":"IF(Rep_Data!R16 = 0, \"-\",IF(Rep_Data!R16 = \"\",\"-\",Rep_Data!R16))","v":"More than 2"},null,null,null,null,null,null,null,null,null,null,null,null,null,{"$f":"Table1[[#This Row],[Speciality]]&Table1[[#This Row],[Q1]]","v":"SurgeryYES"}]
[null,15,{"$f":"Rep_Data!A17","v":"ANTONIO,  ROSALYN"},{"$f":"Rep_Data!C17","v":"O53142"},{"$f":"Rep_Data!G17","v":"Aurora"},{"$f":"Rep_Data!H17","v":"CO"},{"$f":"Rep_Data!I17","v":"80014"},{"$f":"Rep_Data!J17","v":"GP"},{"$f":"IF(Rep_Data!N17 = 0, \"-\",IF(Rep_Data!N17 = \"\",\"-\",Rep_Data!N17))","v":"-"},{"$f":"IF(Rep_Data!O17 = 0, \"-\",IF(Rep_Data!O17 = \"\",\"-\",Rep_Data!O17))","v":"-"},{"$f":"IF(Rep_Data!P17 = 0, \"-\",IF(Rep_Data!P17 = \"\",\"-\",Rep_Data!P17))","v":"-"},{"$f":"IF(Rep_Data!Q17 = 0, \"-\",IF(Rep_Data!Q17 = \"\",\"-\",Rep_Data!Q17))","v":"-"},{"$f":"IF(Rep_Data!R17 = 0, \"-\",IF(Rep_Data!R17 = \"\",\"-\",Rep_Data!R17))","v":"-"},null,null,null,null,null,null,null,null,null,null,null,null,null,{"$f":"Table1[[#This Row],[Speciality]]&Table1[[#This Row],[Q1]]","v":"GP-"}]
[null,16,{"$f":"Rep_Data!A18","v":"ASHA,  KUM"},{"$f":"Rep_Data!C18","v":"O79730"},{"$f":"Rep_Data!G18","v":"Norwood"},{"$f":"Rep_Data!H18","v":"MN"},{"$f":"Rep_Data!I18","v":"55383"},{"$f":"Rep_Data!J18","v":"Ortho"},{"$f":"IF(Rep_Data!N18 = 0, \"-\",IF(Rep_Data!N18 = \"\",\"-\",Rep_Data!N18))","v":"-"},{"$f":"IF(Rep_Data!O18 = 0, \"-\",IF(Rep_Data!O18 = \"\",\"-\",Rep_Data!O18))","v":"-"},{"$f":"IF(Rep_Data!P18 = 0, \"-\",IF(Rep_Data!P18 = \"\",\"-\",Rep_Data!P18))","v":"-"},{"$f":"IF(Rep_Data!Q18 = 0, \"-\",IF(Rep_Data!Q18 = \"\",\"-\",Rep_Data!Q18))","v":"-"},{"$f":"IF(Rep_Data!R18 = 0, \"-\",IF(Rep_Data!R18 = \"\",\"-\",Rep_Data!R18))","v":"-"},null,null,null,null,null,null,null,null,null,null,null,null,null,{"$f":"Table1[[#This Row],[Speciality]]&Table1[[#This Row],[Q1]]","v":"Ortho-"}]
[null,17,{"$f":"Rep_Data!A19","v":"AUDIE,  AUGUST"},{"$f":"Rep_Data!C19","v":"O57841"},{"$f":"Rep_Data!G19","v":"Ocate"},{"$f":"Rep_Data!H19","v":"NM"},{"$f":"Rep_Data!I19","v":"87734"},{"$f":"Rep_Data!J19","v":"GP"},{"$f":"IF(Rep_Data!N19 = 0, \"-\",IF(Rep_Data!N19 = \"\",\"-\",Rep_Data!N19))","v":"YES"},{"$f":"IF(Rep_Data!O19 = 0, \"-\",IF(Rep_Data!O19 = \"\",\"-\",Rep_Data!O19))","v":"3 - 4"},{"$f":"IF(Rep_Data!P19 = 0, \"-\",IF(Rep_Data!P19 = \"\",\"-\",Rep_Data!P19))","v":"1 - 3"},{"$f":"IF(Rep_Data!Q19 = 0, \"-\",IF(Rep_Data!Q19 = \"\",\"-\",Rep_Data!Q19))","v":"More than 3"},{"$f":"IF(Rep_Data!R19 = 0, \"-\",IF(Rep_Data!R19 = \"\",\"-\",Rep_Data!R19))","v":"More than 2"},null,null,null,null,null,null,null,null,null,null,null,null,null,{"$f":"Table1[[#This Row],[Speciality]]&Table1[[#This Row],[Q1]]","v":"GPYES"}]
{"$rows_left_out":233}